{"text_format":"1","workbook":"xlsx","n_sheets":25,"sheets":["Prices","Notes","Implements","Buckets","LOADERpro","Options","trip costs","Loader Details","OEM","AGCO","AGCO Allis","AGCO White","Buhler","Case","Challenger","Deutz","John Deere","Kubota","Landini","MF","McCormick","NH","Valtra","KIOTI","MAHINDRA"],"not_rendered":{"charts":0,"images":9,"macros":1,"external_links":1,"defined_names":16,"comments":0,"pivot_tables":0},"unopened":[],"bounds":{"document_bytes":16777216,"sheet_cells":100000,"rows_first":2000,"rows_last":500,"rows_between":2000,"halvings":0,"cell_chars":16384,"cell_head_chars":4096},"cells_cut":0,"cells_raw":0,"read":"whole","date_system":"1900"}

{"sheet":"Prices","index":0,"n_rows":1861,"n_cols":5,"rows_kept":1861,"cut":false,"hidden":true,"merged":[]}
["Vendor PN","Vendor Description","List Price","Vendor PN","Vendor PN"]
[245099,"HYDR IMPL.LOCK.SET",615,{"$f":"C2*1.05*1.05","v":678.03750000000002},245099]
[246616,"HYDR IMPL.LOCK.SET EURO",615,{"$f":"C3*1.05*1.05","v":678.03750000000002},246616]
[246800,"HYDR.IMPLEM.LOCK. EURO/E-FAUCH",615,678.03750000000002,246800]
[301605,"SELECTO FIX MK3(3) REDSKAPSDEL",331,364.92750000000001,301605]
[301607,"SELECTO FIX MK3(3) LASTARDEL",331,364.92750000000001,301607]
[301852,"HOSE SET WITH SEC.VALVE",530,584.32500000000005,301852]
[301921,"AAC Q710-770, Q920-Q10·80",331,364.92750000000001,301921]
[313325,"SELECTO 4 MK3",362,399.10500000000002,313325]
[313411,"LEVER KIT SELECTO",169,186.32250000000002,313411]
[313413,"SELECTO-QUICK III 450-600",813,896.3325000000001,313413]
[313414,"SELECTO-QUICK IV  450-600",700,771.75,313414]
[314010,"SOFTDRIVE Q310-Q660",897,988.94250000000011,314010]
[314050,"SOFTDRIVE Q 790",897,988.94250000000011,314050]
[314070,"SOFTDRIVE Q465,675,695",897,988.94250000000011,314070]
[317015,"ERGODRIVE DEUTZ DX",1494,1647.1350000000002,317015]
[317043,"HYDR SET (B) FORD 8210",1494,1647.1350000000002,317043]
[317044,"HYDR.SET (B) FORD 5110-7610",1494,1647.1350000000002,317044]
[317046,"HYDR SET (B) FORD 5110-7810 LS",1494,1647.1350000000002,317046]
[317047,"HYDR.SET (B) FORD 2910-4110",1494,1647.1350000000002,317047]
[317048,"HYDR SET (B) FORD 6710-7710",1494,1647.1350000000002,317048]
[317049,"HYDR.SET (B) FORD 7810",1494,1647.1350000000002,317049]
[317051,"HYDR SET (B) FORD 3430-5030",1494,1647.1350000000002,317051]
[317059,"HYDR SET (B) JD 17-2850 MC1/CC",1494,1647.1350000000002,317059]
[317061,"HYDR SET (B) JD 3040-3350",1494,1647.1350000000002,317061]
[317081,"HYDR SET (B) MF 194F-394H",1494,1647.1350000000002,317081]
[317084,"HYDR SET (B) MF 265",1494,1647.1350000000002,317084]
[317121,"HYDR SET (B) SAME ANTARES 110",1494,1647.1350000000002,317121]
[317132,"HYDR SET (B) KUBOTA M50-6030",1494,1647.1350000000002,317132]
[317133,"HYDR SET (B) KUBOTA M70-8030",1494,1647.1350000000002,317133]
[317134,"HYDR SET (B) KUBOTA M69-8950",1494,1647.1350000000002,317134]
[317135,"HYDR SET (B) KUBOTA M75-9580",1494,1647.1350000000002,317135]
[317136,"HYDR SET (B) KUBOTA L48-5450",1494,1647.1350000000002,317136]
[317146,"HYDR SET (B) JD 4050-4455",1494,1647.1350000000002,317146]
[317147,"HYDR SET (B) SAME LASER 13-150",1494,1647.1350000000002,317147]
[317148,"HYDR SET (B) AGCO-ALLIS 4650-",1494,1647.1350000000002,317148]
[317149,"HYDR SET (B) AGCO-ALLIS",1494,1647.1350000000002,317149]
[317150,"HYDR SET (B) AGCO-ALLIS",1494,1647.1350000000002,317150]
[317151,"HYDR SET (B) AGCO-ALLIS",1494,1647.1350000000002,317151]
[317155,"HYDR SET (B) AGCO-ALLIS 7600",1494,1647.1350000000002,317155]
[317162,"HYDR.SET (B) D.I.Y.",1494,1647.1350000000002,317162]
[317165,"HYDR SET (B) ZETOR 3320-6340",1494,1647.1350000000002,317165]
[317185,"HYDR SET (B) landini adv",1494,1647.1350000000002,317185]
[317202,"HYDR SET (B) MF 342-399",1494,1647.1350000000002,317202]
[317204,"HYDR SET (B) CASE 585-4240 (L)",1494,1647.1350000000002,317204]
[317211,"HYDR SET (B) SAME ARGON",1494,1647.1350000000002,317211]
[317215,"HYDR.SET (B) LANDINI BLIZZARD",1494,1647.1350000000002,317215]
[317216,"HYD.SET (B) FORD",1494,1647.1350000000002,317216]
[317217,"HYDR SET (B) JD 8100-8400",1494,1647.1350000000002,317217]
[317222,"HYDR.SET KUBOTA M4700F-5400F",1494,1647.1350000000002,317222]
[317225,"HYDR.SET (B) MF",1494,1647.1350000000002,317225]
[317226,"HYDR SET (B) MF 8110-30",1494,1647.1350000000002,317226]
[317234,"HYDR SET (B) MF 365-398 ROPS",1494,1647.1350000000002,317234]
[317240,"HYDR SET NH M100-160,8160-8560",1494,1647.1350000000002,317240]
[317241,"HYDR SET NH M100-160,8160-8560",1494,1647.1350000000002,317241]
[317242,"HYDR SET NH L60-95,4635-7535 L",1494,1647.1350000000002,317242]
[317249,"HYDR SET SAME/LAMB 60/70",1494,1647.1350000000002,317249]
[317251,"HYDR SET MF 240,253 4WD",1494,1647.1350000000002,317251]
[317257,"HYD.SET AGCO ALLIS",1494,1647.1350000000002,317257]
[317260,"HYD.SET FORD 3910-4630",1494,1647.1350000000002,317260]
[317275,"HYDR SET JD 5300-5500",1494,1647.1350000000002,317275]
[317281,"HYDR SET NH 3010",1494,1647.1350000000002,317281]
[317282,"HYD.SET MF 231,240,253,261",1494,1647.1350000000002,317282]
[317284,"HYDR.SET  MF 283",1494,1647.1350000000002,317284]
[317296,"HYDR SET ZETOR 4341-7341",1494,1647.1350000000002,317296]
[317297,"HYDR SET KUBOTA M8200,M9000",1494,1647.1350000000002,317297]
[317298,"HYDR SET  JD 4020-4430",1494,{"$f":"C67*1.05*1.05","v":1647.1350000000002},317298]
[317302,"HYDR SET LANDINI  60,70",1494,1647.1350000000002,317302]
[317303,"HYD.SET AGCO ALLIS/WHITE",1494,1647.1350000000002,317303]
[317304,"HYDR SET ZETOR 7540-10540",1494,1647.1350000000002,317304]
[317305,"HYDR SET AGROPLUS 75-100",1494,1647.1350000000002,317305]
[317306,"HYD.SET AGCO ALLIS/WHITE",1494,1647.1350000000002,317306]
[317318,"HYDR SET MF 6110-6150 LS",1494,1647.1350000000002,317318]
[317319,"HYDR SET MF 6160-6190 LS",1494,1647.1350000000002,317319]
[317322,"HYDR SET DEUTZ AGROPLUS 70",1494,1647.1350000000002,317322]
[317323,"HYDR SET SAME/LAMBORGHINI",1494,1647.1350000000002,317323]
[317324,"HYDR SET MF 6235-6265",1494,1647.1350000000002,317324]
[317326,"HYDR SET MF 4260,4270 ROPS",1494,1647.1350000000002,317326]
[317331,"HYDR SET MF 6260-6290",1494,1647.1350000000002,317331]
[317335,"HYDR SET KUBOTA M8200,M9000",1494,1647.1350000000002,317335]
[317337,"HYDR SET MF 8210-8260",1494,1647.1350000000002,317337]
[317338,"HYDR SET NH M100-160,8160-8560",1494,1647.1350000000002,317338]
[317342,"HYDR SET NEW H TNS",1494,1647.1350000000002,317342]
[317348,"HYDR SET SAME 110,130 /LAMBORG",1494,1647.1350000000002,317348]
[317503,"HYDR SET KUBOTA M4900-M6800",1494,1647.1350000000002,317503]
[317506,"HYDR SET NEW HOLLAND TN55-75",1494,1647.1350000000002,317506]
[317507,"HYD.SET  LANDINI ATLAS 70-90",1494,1647.1350000000002,317507]
[317509,"HYDR SET JD 5310N-5510N",1494,1647.1350000000002,317509]
[317521,"HYDR SET DEUTZ AGROLUX",1494,1647.1350000000002,317521]
[317523,"HYDR.SET DEUTZ AGROLUX 80",1494,1647.1350000000002,317523]
[320155,"SUBFR UM JD 4050-4450",3049,3361.5225000000005,320155]
[320255,"SUBFR SAME ANTARES",3049,3361.5225000000005,320255]
[320285,"SUBFR SET UM FORD 8210",2596,2862.09,320285]
[320325,"SUBFR SAME-LASER 130",2596,2862.09,320325]
[320335,"SUBFR SAME 150-AGCO 7650",2596,2862.09,320335]
[320435,"SUBFR SET UM IH 886",2596,2862.09,320435]
[320445,"SUBFR SET UM LANDINI LEGEND",3049,3361.5225000000005,320445]
[320605,"SUBFR SET UM NEWH M100-160 etc",3049,3361.5225000000005,320605]
[320625,"SUBFRAME AGCO-A 9735,9745",3049,3361.5225000000005,320625]
[320635,"SUBFRAME AGCO-W 8310,8410",3049,3361.5225000000005,320635]
[320734,"SUBFR SET UM MF 8240-8250",3049,3361.5225000000005,320734]
[320744,"SUBFR SET UM MF 8250-8260",3049,3361.5225000000005,320744]
[320915,"SUBFR SET UM NEWH TM115-165etc",3049,3361.5225000000005,320915]
[320945,"SUBFR SET UM MF 8240,8250",3049,3361.5225000000005,320945]
[320964,"SUBFR UM C-IH MAXXUM 100-170",3049,3361.5225000000005,320964]
[320975,"SUBFR SET SAME 110,130/LAMBORG",3049,3361.5225000000005,320975]
[324014,"SUBFR SET UL CASE MAGNUM",3643,4016.4075000000003,324014]
[324035,"SUBFR SET UL JD 4755-5955",3643,4016.4075000000003,324035]
[325505,"SUBFR FORD 29-4110",2219,2446.4475000000002,325505]
[340215,"SUBFR MF 399",2219,2446.4475000000002,340215]
[341035,"SUBFR FORD 7810",2596,2862.09,341035]
[341124,"SUBFR FORD 34-4630",2219,2446.4475000000002,341124]
[341384,"SUBFR JD 1750-1950 CC2",2219,2446.4475000000002,341384]
[341505,"SUBFR MF 365-398",2219,2446.4475000000002,341505]
[341555,"SUBFRAME AGCO-A 4650, 4660",2219,2446.4475000000002,341555]
[341575,"SUBFRAME AGCO-ALLIS",2219,2446.4475000000002,341575]
[341585,"SUBFRAME AGCO-ALLIS",2219,2446.4475000000002,341585]
[341645,"SUBFRAME AGCO-ALLIS",2219,2446.4475000000002,341645]
[341715,"SUBFRAME AGCO-WHITE 6065",2219,2446.4475000000002,341715]
[341725,"SUBFRAME AGCO-WHITE 6085",2219,2446.4475000000002,341725]
[341925,"SUBFR ZETOR 5011-7745",2219,2446.4475000000002,341925]
[341954,"SUBFRAME DEUTZ",2219,2446.4475000000002,341954]
[341965,"SUBFR SET ZETOR 5011-7745",2219,2446.4475000000002,341965]
[342005,"SUBFR KUBOTA M521",2219,2446.4475000000002,342005]
[342015,"SUBFR KUBOTA M541",2219,2446.4475000000002,342015]
[342024,"*SUBFR KUBOTA M542",2219,2446.4475000000002,342024]
[342035,"SUBF.FORD 56-7610 N.AM",2219,2446.4475000000002,342035]
[342045,"SUBF.FORD 67-7710 N.AM",2219,2446.4475000000002,342045]
[342065,"SUBFR KUBOTA M511",2219,2446.4475000000002,342065]
[342084,"*SUBFR KUBOTA 75-9580",2219,2446.4475000000002,342084]
[342105,"SUBF SET KUBOTA M4700F-5400F",2219,{"$f":"C131*1.05*1.05","v":2446.4475000000002},342105]
[342125,"SUBFRAME KUBOTA 7030 SU",2219,2446.4475000000002,342125]
[342154,"SUBFR SET KUBOTA M8200,M9000",2219,2446.4475000000002,342154]
[343235,"SUBFR FORD 4830-5030",2219,2446.4475000000002,343235]
[343375,"SUBFR SET MF 365-398",2219,2446.4475000000002,343375]
[343415,"SUBFR SET MF 396-399",2219,2446.4475000000002,343415]
[343485,"SUBFR ZETOR 4340-7745",2219,2446.4475000000002,343485]
[343605,"SUBFR SET MF377-1007/LANDINI",2219,2446.4475000000002,343605]
[343614,"SUBFR SET LAND 50/ MF233-253",2219,2446.4475000000002,343614]
[343634,"SUBFR LANDINI 65-85/MF273-393",2219,2446.4475000000002,343634]
[343635,"SUBFR LANDINI BLIZZARD",2219,2446.4475000000002,343635]
[343845,"SUBFR SET MF 3075-6150",2219,2446.4475000000002,343845]
[344224,"SUBFR SET CASE MAXXUM 5120",2219,2446.4475000000002,344224]
[344444,"SUBFRAME MF 261 2WD",2219,2446.4475000000002,344444]
[344455,"SUBFR MF 362 ROPS",2219,2446.4475000000002,344455]
[344534,"SUBFR SET FORD 5640-7740",2219,2446.4475000000002,344534]
[344545,"SUBFR FORD 78-8340",2596,2862.09,344545]
[344554,"SUBFR MF 8110-8130",3049,3361.5225000000005,344554]
[344605,"SUBFR SAME 100.6/LAMB 1060",3049,3361.5225000000005,344605]
[344614,"SUBFR SET MF 362-372-382",2219,2446.4475000000002,344614]
[344675,"SUBFR DEUTZ AGROPLUS 60",2219,2446.4475000000002,344675]
[344854,"SUBFR. NEWH 3010 S 2WD",2219,2446.4475000000002,344854]
[344935,"SUBFR JD 22-2850 SG2",2219,2446.4475000000002,344935]
[344955,"SUBFR JD 3040-3350",2596,2862.09,344955]
[345004,"SUBFRAME CASE 3210-3220 ROPS",2219,2446.4475000000002,345004]
[345014,"SUBFRAME CASE 3230-4240 ROPS",2219,2446.4475000000002,345014]
[345205,"SUBFR SET CASE 585-995, 3230-4",2219,2446.4475000000002,345205]
[345275," SUBF SET JD 4020",2219,2446.4475000000002,345275]
[345285," SUBF SET JD 4430",2596,2862.09,345285]
[345345,"SUBFR SET LANDINI GLOBUS 60,70",2219,2446.4475000000002,345345]
[345355,"SUBFRAME SET AGCO 8775,8785",2596,2862.09,345355]
[345365,"SUBFRAME SET AGCO W 67-6810",2596,2862.09,345365]
[345375,"SUBFR SET ZETOR 7540",2219,2446.4475000000002,345375]
[345385,"SUBFR ZETOR 8540-9540",2219,2446.4475000000002,345385]
[345395,"SUBFR ZETOR 10540",2596,2862.09,345395]
[345434,"SUBFR SET CASE CX50-60",2219,2446.4475000000002,345434]
[345445,"SUBFR SET SAME SILVER/LAMB",2596,2862.09,345445]
[345475,"SUBFRAME AGCO-WHITE 6065",2219,2446.4475000000002,345475]
[345495,"SUBFRAME AGCO-ALLIS 8745,8765",2219,2446.4475000000002,345495]
[345505,"SUBFRAME AGCO-ALLIS 8745,8765",2219,2446.4475000000002,345505]
[345515,"SUBFRAME AGCO-WHITE 6410,6510",2219,2446.4475000000002,345515]
[345615,"SUBFR SAME 60/LAMB 664-60",2219,2446.4475000000002,345615]
[345695,"SUBFR DEUTZ AGROPLUS 70",2219,2446.4475000000002,345695]
[345725,"SUBFR SET ZETOR 3321,3341",2219,2446.4475000000002,345725]
[345755,"SUBFR SET  MF 6255,6265",2219,2446.4475000000002,345755]
[345825,"SUBFRAME NH 6635, 7635",2219,2446.4475000000002,345825]
[345865,"SUBFR SET AGROPLUS 75,85,95",2219,2446.4475000000002,345865]
[345875,"SUBFR SET AGROPLUS 100",2219,2446.4475000000002,345875]
[345924,"SUBFR SET JD 6010-6410",2219,2446.4475000000002,345924]
[345955,"SUBFR SAME 70/LAMB 674-70",2219,2446.4475000000002,345955]
[345965,"SUBFR SAME 80-90/LAMB 7-874",2219,2446.4475000000002,345965]
[345984,"SUBF.SET NEW H TN55S-TN75S",2219,2446.4475000000002,345984]
[346015,"SUBFRAME MF 4225-4255 ROPS",2219,2446.4475000000002,346015]
[346025,"SUBFR MF 4260,4270 ROPS",2219,2446.4475000000002,346025]
[346054,"SUBFR SET US CASE MX 80-100",2596,2862.09,346054]
[346064,"SUBFR SET US MC CORMICK MC 115",2596,2862.09,346064]
[346094,"SUBF.SET NEW H TN55D-TN75D",2219,2446.4475000000002,346094]
[346194,"SUBFR SET LANDINI REX/MF 3225S",2219,2446.4475000000002,346194]
[346274,"SUBF SET MF 240, 253 4WD",2219,2446.4475000000002,346274]
[346285,"SUBFR SAME 70/LAMB 674-70",2219,2446.4475000000002,346285]
[346425,"SUBFR ZETOR 4321-7341",2219,2446.4475000000002,346425]
[346515,"SUBF SET LANDINI ATLAS 70-85",2219,2446.4475000000002,346515]
[346525,"SUBFR SET LANDINI GHIBLI 80-10",2219,2446.4475000000002,346525]
[346544,"SUBFR SET KUBOTA M8200,M9000",2219,2446.4475000000002,346544]
[346555,"SUBF SET LANDINI ATLAS 90",2219,{"$f":"C195*1.05*1.05","v":2446.4475000000002},346555]
[346575,"SUBFR SET LANDINI GLOBUS 55/ M",2219,2446.4475000000002,346575]
[346665,"SUBFR SET MF 6235-6255",2219,2446.4475000000002,346665]
[346675,"SUBFR SET MF 6235-6245",2219,2446.4475000000002,346675]
[346685,"SUBFR SET LANDINI MYTHOS 90,10",2219,2446.4475000000002,346685]
[346715,"SUBFR MF 6160-6180",2596,2862.09,346715]
[944934,"SUBFR SET DORADO 90",2596,2862.09,944934]
[4500063,"Bearing Box Conversion Kit",1333,1469.6325000000002,4500063]
[4500064,"Bearing Box Conversion Kit",1333,1469.6325000000002,4500064]
[4500065,"Bearing Box Conversion Kit",1333,1469.6325000000002,4500065]
[4500066,"Bearing Box Conversion Kit",1333,1469.6325000000002,4500066]
[4500123,"Bearing Box Conversion Kit",1333,1469.6325000000002,4500123]
[4500124,"Bearing Box Conversion Kit",1333,1469.6325000000002,4500124]
[4500188,"HYDRO-QUICK 6 (CONTROL VALVE)",939,1035.2475000000002,4500188]
[4500189,"HYDRO-QUICK 6 (HOSE KIT)",939,1035.2475000000002,4500189]
[5020959,"LEVER KIT SELECTO",170,187.42500000000001,5020959]
[5033973,"CONV.SION KIT LCS OLD LOADER S",165,181.91249999999999,5033973]
[5033977,"CONV.SION KIT LCS OLD LOADER M",637,702.29250000000002,5033977]
[5034021,"CONV. KIT LCS LOADER OLD VALVE",165,181.91249999999999,5034021]
[5034067,"MC4 BASE JIC 1 1/16",165,181.91249999999999,5034067]
[5034071,"CONV.KIT LCS LOAD OLD VALVE HQ",299,329.64749999999998,5034071]
[5034083,"EXTERNAL ACCUMULATOR KIT LCS",114,125.685,5034083]
[5034241,"Soft Drive - All X Series",751,827.97750000000008,5034241]
[5034283,"Field Installed Live 3rd - Electrodrive",989,1090.3725000000002,5034283]
[5034284,"Field Installed Live 3rd - Mechanical",989,1090.3725000000002,5034284]
[5044970,"CONVERSION BLOCK  MC-4 KIT",641,706.7025000000001,5044970]
[5048136,"SOFTDRIVE 2 ACC EXTERNAL",897,988.94250000000011,5048136]
[5048137,"SOFTDRIVE 3 ACC EXTERNAL",897,988.94250000000011,5048137]
[5048217,"Loader Light Kit",553,609.6825,5048217]
[5201080,"ELECTRICAL ON/OFF SOFTDRIVE",935,1030.8375000000001,5201080]
[5201117,"TOOL CARRIER SKID STEER COMPL",935,1030.8375000000001,5201117]
[5201154,"HYDRO-QUICK /MULTI-DOC 4H",657,724.34250000000009,5201154]
[5201155,"HYDRO-QUICK LOWER PART",411,453.12750000000005,5201155]
[5201227,"HYDRO-QUICK UPPER PART",246,271.21500000000003,5201227]
[5215230,"SOFTDRIVE KIT MANUAL",651,717.72750000000008,5215230]
[5215231,"SOFTDRIVE KIT MANUAL Q50-Q65",837,922.79250000000002,5215231]
[5215232,"SOFTDRIVE KIT MANUAL Q75-Q85",837,922.79250000000002,5215232]
[5215241,"SOFTDRIVE KIT EL",433,477.38250000000005,5215241]
[5215251,"3RD FUNCTION VALVE AS-KIT DM",617,680.24250000000006,5215251]
[5215252,"3RD FUNCTION VALVE AS-KIT DL",790,870.97500000000002,5215252]
[5215254,"4TH FUNCTION VALVE AS-KIT DM",838,923.8950000000001,5215254]
[5215255,"4TH FUNCTION VALVE AS-KIT DL",611,673.62750000000005,5215255]
[5215263,"HYDRAULIC LOCKING KIT EURO DM",615,678.03750000000002,5215263]
[5215267,"HYDRAULIC LOCKING KIT EURO DL",615,678.03750000000002,5215267]
[5215270,"LIVE 3RD HOSE AS-KIT Q55",556,612.99000000000012,5215270]
[5215271,"LIVE 3RD HOSE AS-KIT Q65",556,612.99000000000012,5215271]
[5215272,"LIVE 3RD HOSE AS-KIT Q75",575,633.9375,5215272]
[5215273,"LIVE 3RD HOSE AS-KIT Q85",575,633.9375,5215273]
[5220293,"SWITCH KIT",169,186.32250000000002,5220293]
[5220451,"3RD FUNKT. AS-KIT DM (BSP3/8)",848,934.92000000000019,5220451]
[5220452,"3RD FUNCT. AS-KIT DL (BSP 3/8)",848,934.92000000000019,5220452]
[5220454,"4TH FUNCT.AS-KIT DM (BSP3/8)",848,934.92000000000019,5220454]
[5220455,"4TH FUNCT. AS-KIT DL (BSP3/8)",848,934.92000000000019,5220455]
[5220469,"LIVE 3RD HOSE AS-KIT Q45 3/8\"",330,363.82499999999999,5220469]
[5220470,"LIVE 3RD AS-KIT Q55 (BSP3/8\")",330,363.82499999999999,5220470]
[5220471,"LIVE 3RD AS-KIT Q65 (BSP 3/8)",330,363.82499999999999,5220471]
[5220472,"LIVE 3RD AS-KIT Q75 (BSP3/8\")",330,363.82499999999999,5220472]
[5220473,"LIVE 3RD AS-KIT Q85 (BSP3/8\")",330,363.82499999999999,5220473]
[5220483,"HYDRO QUICK 4 COUPLER",657,724.34250000000009,5220483]
[5220484,"HYDRO QUICK 6 COUPLER",939,1035.2475000000002,5220484]
[5220517,"4TH FU.AS-KIT DL (BSP3/8) LCS",848,934.92000000000019,5220517]
[5220518,"4TH FU.AS-KIT DM (BSP3/8) LCS",848,934.92000000000019,5220518]
[5220519,"4TH FU.AS-KIT DS (BSP3/8) LCS",848,934.92000000000019,5220519]
[5220526,"SOFTDRIVE EL.KIT LCS",433,477.38250000000005,5220526]
[5220530,"MULTICOUPLER MC-4",637,{"$f":"C259*1.05*1.05","v":702.29250000000002},5220530]
[5220541,"HYDR CONN KIT LCS MC-2",542,597.55500000000006,5220541]
[5220576,"ADDON KIT",165,181.91249999999999,5220576]
[5220581,"3RD FUNKTION  AS-KIT DXL",848,934.92000000000019,5220581]
[5220650,"SOFTDRIVE KIT DS MANUAL",751,827.97750000000008,5220650]
[5220651,"SOFTDRIVE KIT DM MANUAL",751,827.97750000000008,5220651]
[5220652,"SOFTDRIVE KIT DS",934,1029.7350000000001,5220652]
[5220653,"SOFTDRIVE KIT DM",934,1029.7350000000001,5220653]
[5220654,"SOFTDRIVE KIT DM",934,1029.7350000000001,5220654]
[5220655,"SOFTDRIVE KIT DL/DXL",934,1029.7350000000001,5220655]
[5220691,"HYDRAULIC LOCKING KIT EURO DS",615,678.03750000000002,5220691]
[5220692,"Hydraulic Locking",615,678.03750000000002,5220692]
[5220693,"HYDRAULIC LOCKING KIT EURO DM",615,678.03750000000002,5220693]
[5220695,"HYDRAULIC LOCKING KIT EURO DL",615,678.03750000000002,5220695]
[5221251,"F-SERIES TOOL CARRIER",1088,1199.5200000000002,5221251]
[5221390,"SOFTDRIVE KIT PENDO",800,882,5221390]
[5221796,"Soft Drive",596,657.09000000000015,5221796]
[5221797,"Mechanical Self Leveling (160C)",544,599.7600000000001,5221797]
[5221798,"Mechanical Self Leveling (180C)",544,599.7600000000001,5221798]
[9031984,"LIVE 3RD HOSE AS-KIT LCS MC 2",571,629.52750000000015,9031984]
[9031986,"LIVE 3RD HOSE AS-KIT LCS MC 2",571,629.52750000000015,9031986]
[9031988,"LIVE 3RD HOSE AS-KIT LCS MC2",571,629.52750000000015,9031988]
[9031990,"LIVE 3RD HOSE AS-KIT LCS MC2",571,629.52750000000015,9031990]
[9031994,"LIVE 3RD HOSE AS-KIT LCS MC2",571,629.52750000000015,9031994]
[9031996,"LIVE 3RD HOSE AS-KIT LCS MC2",571,629.52750000000015,9031996]
[10301570,"MOUNTING SET H-Q MK2",119,131.19750000000002,10301570]
[10317113,"HYDR.SET CASE MAXXUM",1494,1647.1350000000002,10317113]
[10317180,"HYDR SET  JD 7600-7800",1494,1647.1350000000002,10317180]
[10317263,"HYDR SET VALTRA A-SERIES RIGHT",1494,1647.1350000000002,10317263]
[10317285,"HYDR.SET CASE MAXXUM  100-135",1494,1647.1350000000002,10317285]
[10317288,"HYDR SET JD 6200,6400SE",1494,1647.1350000000002,10317288]
[10317290,"HYDR SET CASE MAXXUM  100-135",1494,1647.1350000000002,10317290]
[10317294,"HYDR.SET CASE CX50-105/MCCORM",1494,1647.1350000000002,10317294]
[10317319,"HYDR SET MF 6160-6190 LS",1494,1647.1350000000002,10317319]
[10317325,"HYDR SET MF 6235-6265",1494,1647.1350000000002,10317325]
[10317525,"HYDR.SATS MF 3330-3355",1494,1647.1350000000002,10317525]
[10317532,"HYDR SET SAME/LAMBORGHINI",1494,1647.1350000000002,10317532]
[10317535,"HYDR.SET MF 251 XE",1494,1647.1350000000002,10317535]
[10317536,"HYDR SET LANDINI REX 70-100",1494,1647.1350000000002,10317536]
[10317537,"HYDR.SATS MF 4325-4370",1494,1647.1350000000002,10317537]
[10317539,"HYDR SET NH TN55D-75D",1494,1647.1350000000002,10317539]
[10317540,"HYDR SET JD 6020-6920",1494,1647.1350000000002,10317540]
[10317545,"HYDR.SET AGCO",1494,1647.1350000000002,10317545]
[10317546,"HYDR SET MF4225-4270",1494,1647.1350000000002,10317546]
[10317548,"HYDR SET AGROTRON MK3",1494,1647.1350000000002,10317548]
[10317555,"HYDR.SET NH L/35,TL",1494,1647.1350000000002,10317555]
[10317557,"HYDR SET LS MF 8200-SER",1494,1647.1350000000002,10317557]
[10317560,"HYDR.SET LANDINI GHIBLI 80-100",1494,1647.1350000000002,10317560]
[10317565,"HYDR.SET JD 5020 N AMERIKA",1494,1647.1350000000002,10317565]
[10317568,"HYDR.SET JD 6003-SER",1494,1647.1350000000002,10317568]
[10317569,"HYDR SET LANDINI LEGEND 115-80",1494,1647.1350000000002,10317569]
[10317570,"HYDR.SET NH TN65F-90F",1494,1647.1350000000002,10317570]
[10317576,"HYDR SET  LANDINI MYTHOS 90-11",1494,1647.1350000000002,10317576]
[10317597,"HYDR.SET LANDINI VISION",1494,1647.1350000000002,10317597]
[10317600,"HYDR SET ZETOR 8621-11641",1494,1647.1350000000002,10317600]
[10317603,"HYDR.SET NEW H TB100-120",1494,1647.1350000000002,10317603]
[10317609,"HYDR.SET KUBOTA M100",1494,1647.1350000000002,10317609]
[10317611,"HYDR.SET NEW H TDD/CASE JX  NA",1494,1647.1350000000002,10317611]
[10317618,"HYDR.SET FENDT 208-209 P",1494,1647.1350000000002,10317618]
[10317624,"HYDR SET MF 6260-6290",1494,1647.1350000000002,10317624]
[10317625,"HYDR SET LS MF 6260-6290",1494,1647.1350000000002,10317625]
[10317627,"HYDR.SET VALTRA 100-SER BRAZIL",1494,1647.1350000000002,10317627]
[10317632,"HYDR SET MF 6465-6480 OC",1494,1647.1350000000002,10317632]
[10317633,"HYDR SET MF 6445-7480 LS",1494,1647.1350000000002,10317633]
[10317637,"HYDR.SET MF 291-492",1494,{"$f":"C323*1.05*1.05","v":1647.1350000000002},10317637]
[10317646,"HYDR SET MF 5425-5465 OC",1494,1647.1350000000002,10317646]
[10317648,"HYDR.SET VALTRA T&M SERIES",1494,1647.1350000000002,10317648]
[10317649,"HYDR.SET MC CORMICK, MC,MTX",1494,1647.1350000000002,10317649]
[10317650,"HYDR.SET LS NH TM 115-190/CASE",1494,1647.1350000000002,10317650]
[10317651,"HYDR.SET NH TM CLASSIC",1494,1647.1350000000002,10317651]
[10317652,"HYDR SET NEW HOLLAND TS90-115",1494,1647.1350000000002,10317652]
[10317658,"HYDR.SET VALTRA 6 & 8000 SER",1494,1647.1350000000002,10317658]
[10317660,"HYDR.SET JD 7720-7920",1494,1647.1350000000002,10317660]
[10317661,"HYDR.SET MF 425, 435, 440",1494,1647.1350000000002,10317661]
[10317665,"HYDR.SET MF 471-481 CAB",1494,1647.1350000000002,10317665]
[10317667,"HYDR.SET KUBOTA M105S",1494,1647.1350000000002,10317667]
[10317669,"HYDR.SET MF 5425-5465",1494,1647.1350000000002,10317669]
[10317671,"HYDR.SET DEUTZ AGROTON MK3",1494,1647.1350000000002,10317671]
[10317672,"HYDR.SET LANDINI POWER FARM",1494,1647.1350000000002,10317672]
[10317674,"HYDR.SET ZETOR 6441-8441",1494,1647.1350000000002,10317674]
[10317675,"HYDR.SET NEW HOLLAND TT55 TT75",1494,1647.1350000000002,10317675]
[10317678,"HYDR.SET VALTRA T-CLASSIC",1494,1647.1350000000002,10317678]
[10317680,"HYDR.SET CASE/STEYR",1494,1647.1350000000002,10317680]
[10317682,"HYDR.SET MF 2400-SER /LANDINI",1494,1647.1350000000002,10317682]
[10317683,"HYDR.SET MC CORMICK, C-MODEL",1494,1647.1350000000002,10317683]
[10317684,"HYDR.SET MC CORMICK,CX",1494,1647.1350000000002,10317684]
[10317685,"HYDR.SET MC CORMICK,MC,MTX",1494,1647.1350000000002,10317685]
[10317686,"HYDR.SET MC CORM,MC,MTX (USA)",1494,1647.1350000000002,10317686]
[10317687,"HYDR.SET JD 6120-6920",1494,1647.1350000000002,10317687]
[10317695,"HYDR.SET KUBOTA M95X-125X",1494,1647.1350000000002,10317695]
[10317703,"HYDR.SET MF 8450-80/AGCO DT",1494,1647.1350000000002,10317703]
[10317705,"HYDR.SET CNH TSA / MXU PROFI",1494,1647.1350000000002,10317705]
[10317709,"HYDR.SET MF 5400 ROPS",1494,1647.1350000000002,10317709]
[10317712,"HYDR SET CASE MAGNUM MX180-270",1494,1647.1350000000002,10317712]
[10317713,"HYDR SET LANDINI REX/MCCOR F-",1494,1647.1350000000002,10317713]
[10317714,"HYDR.SET NH G /BUHLER VERSATIL",1494,1647.1350000000002,10317714]
[10317716,"HYDR SET SAME SILVER/LAMB",1494,1647.1350000000002,10317716]
[10317717,"HYDR.SET JD 5225-5525",1494,1647.1350000000002,10317717]
[10317719,"HYDR.S CNH TN,TNDA/JXC /STEYR",1494,1647.1350000000002,10317719]
[10317720,"HYDR.SET CNH TN,TN-A/JX-C ROPS",1494,1647.1350000000002,10317720]
[10317721,"HYDR.SET KUBOTA M9000 CAB",1494,1647.1350000000002,10317721]
[10317722,"HYDR.SET KUBOTA M9000 ROPS",1494,1647.1350000000002,10317722]
[10317725,"HYDR.SET MC CORMICK  XTX",1494,1647.1350000000002,10317725]
[10317726,"HYDR.SET MC CORMICK  XTX",1494,1647.1350000000002,10317726]
[10317728,"HYDR.SET KUBOTA M95X-105X-125X",1494,1647.1350000000002,10317728]
[10317729,"HYDR SET KUBOTA M110,M120",1494,1647.1350000000002,10317729]
[10317730,"HYDR.SET KUBOTA M95S-105S",1494,1647.1350000000002,10317730]
[10317735,"HYDR SET SAME EXPLORER CLASSIC",1494,1647.1350000000002,10317735]
[10317736,"HYDR.SET MF 451-492  ROPS",1494,1647.1350000000002,10317736]
[10317737,"HYDR.SET MF 471-492  CAB",1494,1647.1350000000002,10317737]
[10317739,"HYDR.SET DEUTZ AGROTR K90,K110",1494,1647.1350000000002,10317739]
[10317742,"HYDR SET SAME EXPLORER 85,95",1494,1647.1350000000002,10317742]
[10317743,"HYDR SET SAME SILVER 85-110",1494,1647.1350000000002,10317743]
[10317745,"HYDR.SET CNH TSA / MXU 6-CYL",1494,1647.1350000000002,10317745]
[10317746,"HYDR SET SAME EXPL. 85T,95T",1494,1647.1350000000002,10317746]
[10317748,"HYDR.SET CNH TNN-A/JXN",1494,1647.1350000000002,10317748]
[10317749,"HYDR.SET CNH TNN-A/JXN ROPS",1494,1647.1350000000002,10317749]
[10317752,"HYDR SET SAME DORADO 56-86",1494,1647.1350000000002,10317752]
[10317754,"HYDR.SET KUBOTA M8540-9540",1494,1647.1350000000002,10317754]
[10317755,"HYDR.SET LANDINI / MCCORM",1494,1647.1350000000002,10317755]
[10317757,"HYDR.S CNH TNDA/JXC /KOMP 4-CY",1494,1647.1350000000002,10317757]
[10317758,"HYDR.SET CNH T6000/MAXUM MULTI",1494,1647.1350000000002,10317758]
[10317766,"HYDR.SET LANDINI LANDPOWER",1494,1647.1350000000002,10317766]
[10317767,"HYDR.SET DEUTZ AGROPLUS 75-100",1494,1647.1350000000002,10317767]
[10317768,"HYDR.SET DEUTZ AGROPLUS 75-100",1494,1647.1350000000002,10317768]
[10317770,"HYDR.SET  LS MF 6400-7400",1494,1647.1350000000002,10317770]
[10317771,"HYDR.SET DEUTZ AGROTRON",1494,1647.1350000000002,10317771]
[10317772,"HYDR.SET CASE/NH  MAGNUM/TG",1494,1647.1350000000002,10317772]
[10317775,"HYDR.SET CNH TNF/TNFA",1494,{"$f":"C387*1.05*1.05","v":1647.1350000000002},10317775]
[10317778,"HYDR.SET CASE/NH TN/TNA",1494,1647.1350000000002,10317778]
[10317780,"HYDR.SET NEW H TDD/CASE JX",1494,1647.1350000000002,10317780]
[10317781,"HYDR.SET VALTRA N ADV.-SERIES",1494,1647.1350000000002,10317781]
[10317782,"HYDR.SET MF 3615-3645",1494,1647.1350000000002,10317782]
[10317784,"HYDR SET VALTRA A-SERIES ROPS",1494,1647.1350000000002,10317784]
[10317788,"HYDR.SET VALTRA N ADV.-SER LH",1494,1647.1350000000002,10317788]
[10317791,"HYDR.SET CNH TSA/MXU X 6-CYL",1494,1647.1350000000002,10317791]
[10317794,"HYDR.SET DEUTZ AGROLUX 57/67",1494,1647.1350000000002,10317794]
[10317797,"HYDR.SET JD 6030",1494,1647.1350000000002,10317797]
[10317799,"HYDR.SET JD 5003-SER",1494,1647.1350000000002,10317799]
[10317800,"HYDR.SET JD 5005-SER",1494,1647.1350000000002,10317800]
[10317802,"HYDR.SET CASE MAGNUM 7110-7250",1494,1647.1350000000002,10317802]
[10317806,"HYDR SET MF 533,543,563",1494,1647.1350000000002,10317806]
[10317807,"HYDR SET SAME EXPL. 85-100",1494,1647.1350000000002,10317807]
[10317808,"HYDR SET MF 533,543,563",1494,1647.1350000000002,10317808]
[10317810,"HYDR.S VALTRA T151-191 ADV-SER",1494,1647.1350000000002,10317810]
[10317812,"HYDR.S LANDINI TECH/ MCCORM CL",1494,1647.1350000000002,10317812]
[10317813,"HYDR SET MF 3625-3655 MOD-F",1494,1647.1350000000002,10317813]
[10317817,"HYDR.SET ZETOR PROXIMA PLUS",1494,1647.1350000000002,10317817]
[10317818,"HYDR.SET DEUTZ AGROTRON K100",1494,1647.1350000000002,10317818]
[10317821,"HYDR.S VALTRA T122-192 (SRT)",1494,1647.1350000000002,10317821]
[10317824,"HYDR.SET JD 6030",1494,1647.1350000000002,10317824]
[10317829,"HYDR.SET KUBOTA M4900-6800",1494,1647.1350000000002,10317829]
[10317830,"HYDR.SET KUBOTA M49-6800 ROPS",1494,1647.1350000000002,10317830]
[10317831,"HYDR.SET CNH TD5000 / JX",1494,1647.1350000000002,10317831]
[10317833,"HYDR.SET  CNH TD5000/JX",1494,1647.1350000000002,10317833]
[10317836,"HYDR.S DEUTZ AGROTRO M640 M650",1494,1647.1350000000002,10317836]
[10317838,"HYDR SET SAME EXPL. 85T,95T",1494,1647.1350000000002,10317838]
[10317850,"HYDR.SET LANDINI POWERMONDIAL",1494,1647.1350000000002,10317850]
[10317860,"HYDR.SET LS JD 6D-SERIES",1494,1647.1350000000002,10317860]
[10317862,"HYDR.SET LS JD 7000/7010 NA",1494,1647.1350000000002,10317862]
[10317863,"HYDR.SET KUBOTA 40-SERIES",1494,1647.1350000000002,10317863]
[10317865,"HYDR SET SAME DORADO 3",1494,1647.1350000000002,10317865]
[10317868,"HYDR.SET LS JD 5E-SERIES",1494,1647.1350000000002,10317868]
[10317871,"HYDR.SET CNH TS6000",1494,1647.1350000000002,10317871]
[10317873,"HYDR SET MF 2650-2680",1494,1647.1350000000002,10317873]
[10317875,"HYDR.SET LANDINI 5H/MCC T,CMAX",1494,1647.1350000000002,10317875]
[10317877,"HYDR.SET LANDINI 5H/MCC T,CMAX",1494,1647.1350000000002,10317877]
[10346884,"SUBF SET KUBOTA M4900-6800",2219,2446.4475000000002,10346884]
[10346894,"SUBF SET KUBOTA 4700-6800 ROPS",2219,2446.4475000000002,10346894]
[10346945,"SUBFR SET US SAME DORADO 85",2219,2446.4475000000002,10346945]
[10346955,"SUBFR SET US SAME DORADO 65",2219,2446.4475000000002,10346955]
[10346995,"SUBFR MF 4360,4370",2219,2446.4475000000002,10346995]
[10347004,"SUBFR SET US KUBOTA 8200N",2219,2446.4475000000002,10347004]
[10347015,"FUND.SATS AGCO-ALLIS 5670-80",2219,2446.4475000000002,10347015]
[10347105,"SUBFR SET US VALTRA A - 100 SE",2219,2446.4475000000002,10347105]
[10347155,"SUBFR SET US SAME ARGON 60-70",2219,2446.4475000000002,10347155]
[10347164,"SUBF SET KUBOTA 4700-6800 ROPS",2219,2446.4475000000002,10347164]
[10347215,"SUBFR SET US DEUTZ AGROL 80",2219,2446.4475000000002,10347215]
[10347225,"SUBF SET NH TS100",2596,2862.09,10347225]
[10347235,"SUBFR AGCO-WHITE 6410,6510",2219,2446.4475000000002,10347235]
[10347245,"SUBFR SET MF 4325-4365",2219,2446.4475000000002,10347245]
[10347305,"SUBFR SET LANDINI GLO-75/MF223",2219,2446.4475000000002,10347305]
[10347334,"SUBF.SET JD 5500 SERIES",2219,2446.4475000000002,10347334]
[10347344,"SUBF.SET JD 5300-5420N",2219,2446.4475000000002,10347344]
[10347355,"SUBFR SET US CASE JX70U-JX100U",2219,2446.4475000000002,10347355]
[10347405,"SUBFR SET US DEUTZ AGROLUX 60",2219,2446.4475000000002,10347405]
[10347415,"SUBFR SET US DEUTZ AGROLUX 70",2219,2446.4475000000002,10347415]
[10347444,"SUBFR SET US KUBOTA M100",2219,2446.4475000000002,10347444]
[10347455,"SUBFR NEWH TL70-100",2219,2446.4475000000002,10347455]
[10347515,"SUBFR SET MF 4325-4365 CAB",2219,2446.4475000000002,10347515]
[10347575,"SUBFR SET LANDINI VISION",2219,2446.4475000000002,10347575]
[10347645,"SUBFR SET US MF 5425-5460",2219,2446.4475000000002,10347645]
[10347715,"SUBFR SET US NNTD55-85 CASEJX/",2219,{"$f":"C451*1.05*1.05","v":2446.4475000000002},10347715]
[10347794,"SUBF SET MF 491,492 ROPS",2219,2446.4475000000002,10347794]
[10347825,"SUBFR SET CASE CX70-100/MC COR",2219,2446.4475000000002,10347825]
[10347834,"SUBF SET MF 275-481",2219,2446.4475000000002,10347834]
[10347864,"SUBF NEWH TT55",2219,2446.4475000000002,10347864]
[10347934,"SUBF SET MF 471,481 CAB",2219,2446.4475000000002,10347934]
[10347944,"SUBF SET FENDT 209P T2",2219,2446.4475000000002,10347944]
[10347955,"SUBFR SET NEW H TLA/ CASE-IH J",2219,2446.4475000000002,10347955]
[10348005,"SUBFR SET LANDINI POWERFARM",2219,2446.4475000000002,10348005]
[10348015,"SUBFR SET LANDINI P FARM/ MCCO",2219,2446.4475000000002,10348015]
[10348094," NH TN,TND,TNDA/CASE JXC NA",2219,2446.4475000000002,10348094]
[10348144,"SUBF SET MF 491,492 CAB",2219,2446.4475000000002,10348144]
[10348154,"SUBF SET US MF 251XE,451",2219,2446.4475000000002,10348154]
[10348164,"SUBF SET US MF 431,461",2219,2446.4475000000002,10348164]
[10348235,"SUBF SET LANDINI ALPINE/MCCORM",2219,2446.4475000000002,10348235]
[10348324,"SUBF SET KUBOTA M95S-105X",2219,2446.4475000000002,10348324]
[10348334,"SUBF SET KUBOTA M110-120,M125X",2219,2446.4475000000002,10348334]
[10348445,"SUBF SET US MF 5425-60 DYNA-4",2219,2446.4475000000002,10348445]
[10377005,"HOSE KIT UNIV.  4-CYL",530,584.32500000000005,10377005]
[10377047,"HOSE KIT STD JD 6120-6920",530,584.32500000000005,10377047]
[10377056,"HOSE KIT SPECIAL  NEW H  TL",530,584.32500000000005,10377056]
[10377095,"HOSE KIT NEW H  TN,TND,TNS",530,584.32500000000005,10377095]
[10377096,"HOSE KIT SPC JD 5220-5520",530,584.32500000000005,10377096]
[10377127,"HOSE KIT NEW H TN,TND,TNS",530,584.32500000000005,10377127]
[10377133,"HOSE KIT SPEC VALTRA T&M SER",530,584.32500000000005,10377133]
[10377134,"HOSE KIT DE LUXE  VALTRA T&M S",1237,1363.7925000000002,10377134]
[10377136,"HOSE KIT BASIC  L=4200",530,584.32500000000005,10377136]
[10377137,"HOSE KIT SPEC  NH TM/CASE MXM",530,584.32500000000005,10377137]
[10377141,"HOSE KIT  SPEC NH TM/CASE MXM",639,704.49750000000006,10377141]
[10377145,"HOSE KIT STD DEUTZ AGR 106-165",530,584.32500000000005,10377145]
[10377146,"HOSE KIT DE LUXE DEUTZ AGROTRO",1237,1363.7925000000002,10377146]
[10377147,"HOSE KIT DE LUXE MF 6445-6480",1237,1363.7925000000002,10377147]
[10377206,"HOSE KIT DE LUXE  VALTRA C-SER",1237,1363.7925000000002,10377206]
[10377209,"HOSE KIT SPEC CNH TL/JX70-100U",530,584.32500000000005,10377209]
[10377214,"HOSE KIT SPEC CNH TN/JXC/KOMP",530,584.32500000000005,10377214]
[10377216,"HOSE KIT SPEC JD 7720-7920",530,584.32500000000005,10377216]
[10377218,"HOSE KIT DE LUXE MF 8450-8480",1237,1363.7925000000002,10377218]
[10377222,"HOSE KIT DE LUXE MF 6485-6495",1237,1363.7925000000002,10377222]
[10377224,"HOSE KIT SPEC MF 3615-3645",530,584.32500000000005,10377224]
[10377232,"HOSE KIT D-L DEUTZ K-SER 90-12",1237,1363.7925000000002,10377232]
[10377234,"HOSE KIT SPC KUBOTA 5040-7040",530,584.32500000000005,10377234]
[10377236,"HOSE KIT CNH TM/MXM/TSA/MXU",530,584.32500000000005,10377236]
[10377237,"HOSE KIT CNH TM/MXM/TSA/MXU",639,704.49750000000006,10377237]
[10377239,"HOSE KIT  CNH TLA/JXU",530,584.32500000000005,10377239]
[10377240,"HOSE KIT  CNH TLA/JXU",530,584.32500000000005,10377240]
[10377241,"HOSE KIT  CNH TN-SA",530,584.32500000000005,10377241]
[10377242,"HOSE KIT CNH MAGNUM/TG",530,584.32500000000005,10377242]
[10377243,"HOSE KIT CNH MAGNUM/TG",639,704.49750000000006,10377243]
[10377246,"HOSE KIT SPEC VALTRA N ADV",530,584.32500000000005,10377246]
[10377265,"HOSE KIT CNH T7000/PUMA  OEM",530,584.32500000000005,10377265]
[10377266,"HOSE KIT CNH T7000/PUMA  OEM",639,704.49750000000006,10377266]
[10377272,"HOSE KIT DE LUXE  VALTRA C-SER",1237,1363.7925000000002,10377272]
[10377273,"HOSE KIT DE LUXE  VALTRA T ADV",1237,1363.7925000000002,10377273]
[10377274,"HOSE KIT D-LUXE  VALTRA T-CLAS",1237,1363.7925000000002,10377274]
[10377277,"HOSE KIT JD 7720-7920",639,704.49750000000006,10377277]
[10377283,"HOSE KIT MF 3625-3655 MOD F",530,584.32500000000005,10377283]
[10377284,"HOSE KIT D-L DEUTZ AGR 120-180",1237,1363.7925000000002,10377284]
[10377287,"HOSE KIT D-L MF 6465,6475-6499",1237,1363.7925000000002,10377287]
[10380265,"SUBFR SET UM NEWH TM115-165",3049,3361.5225000000005,10380265]
[10380425,"SUBFR SET UM NH TM175,TM190",3049,3361.5225000000005,10380425]
[10380465,"SUBFR SET UM NH TM175,TM190",3049,3361.5225000000005,10380465]
[10380624,"SUBFR SET UM MCCORMICK 120-135",3049,3361.5225000000005,10380624]
[10380815,"NH TB100/110 UM SUBFRAME",2219,2446.4475000000002,10380815]
[10380834,"SUBFR SET UM MCCORMICK MTX",3049,3361.5225000000005,10380834]
[10384195,"SUBFR SET UL FENDT 900-SER",3643,{"$f":"C515*1.05*1.05","v":4016.4075000000003},10384195]
[10384205,"SUBFR SET UL FENDT 900-SER",3643,4016.4075000000003,10384205]
[10384255,"SUBFR SET UL FENDT 900-SER",3643,4016.4075000000003,10384255]
[10384265,"SUBFR SET UL FENDT 900-SER STD",3643,4016.4075000000003,10384265]
[10384285,"SUBF SET UL FENDT 900-SER",3643,4016.4075000000003,10384285]
[10384295,"SUBF SET UL FENDT 900-SER STD",3643,4016.4075000000003,10384295]
[10550180,"SELECTO FIX KIT MOBILE PART",322,355.00500000000005,10550180]
[10550218,"SELECTO 3 MK4",1080,1190.7,10550218]
[10550379,"SELECTO FIX , FIXED PART 1/2\"",569,627.3225000000001,10550379]
[10550380,"SELECTO FIX , FIXED PART 3/8\"",569,627.3225000000001,10550380]
[10550381,"ESV KIT",1017,1121.2425000000003,10550381]
[10550440,"3RD VALVE AS-KIT",1034,1139.9850000000001,10550440]
[10550441,"3rd Valve - Direct - SL",1034,1139.9850000000001,10550441]
[10550442,"3RD VALVE AS-KIT NSL WIRE",1034,1139.9850000000001,10550442]
[10550443,"3rd Valve - Direct - NSL",1034,1139.9850000000001,10550443]
[10550452,"3rd Function (Cable Control Valve)",596,657.09000000000015,10550452]
[10550453,"3rd Function (Direct Control Valve)",596,657.09000000000015,10550453]
[10550478,"3rd Service X Series SL Loader with LCS",1034,1139.9850000000001,10550478]
[10550480,"3rd Service X Series NSL Loader with LCS",1034,1139.9850000000001,10550480]
[11262540,"Serrated Cutting Edge Kit",998,1100.2950000000001,11262540]
[14100014,"SUBF BOOMER 30 ",1034,1139.9850000000001,14100014]
[14100025,"SUBF BOOMER 40 ",1034,1139.9850000000001,14100025]
[14100055,"SUBF BOOMER 4055,60",1034,1139.9850000000001,14100055]
[14100065,"SUBF MF1547-1655",1034,1139.9850000000001,14100065]
[14100075,"SUBF MF 1560,1660",1034,1139.9850000000001,14100075]
[14100095,"SUBF BOOMER 3040,45",1034,1139.9850000000001,14100095]
[14100104,"SUBF MF GCS",1034,1139.9850000000001,14100104]
[14100125,"SUBF MA 5035",1034,1139.9850000000001,14100125]
[14100144,"SUBF MF 2605,15",1034,1139.9850000000001,14100144]
[14100154,"SUBF BOOMER 1030 ",1034,1139.9850000000001,14100154]
[14100184,"SUBF MF 2625,35",1034,1139.9850000000001,14100184]
[14100185,"SUBF MF 1533-1635",1034,1139.9850000000001,14100185]
[14100195,"SUBF MF 1529-32",1034,1139.9850000000001,14100195]
[14100215,"SUBF KIOTI CK 20,22",1034,1139.9850000000001,14100215]
[14100225,"SUBF MA 5010",1034,1139.9850000000001,14100225]
[14100244,"SUBF KIOTI CK 27-35",1034,1139.9850000000001,14100244]
[14100414,"SUBF KIOTI DK55",1034,1139.9850000000001,14100414]
[14100514,"SUBF KIOTI DK40-50",1034,1139.9850000000001,14100514]
[14100525,"SUBF KU MX",1034,1139.9850000000001,14100525]
[14100535,"SUBF KU L32-3940",1034,1139.9850000000001,14100535]
[14100544,"SUBF JD 5045D",1034,1139.9850000000001,14100544]
[14100555,"SUBF KIOTI DK40-50",1034,1139.9850000000001,14100555]
[14100573,"REAR EXT. MF 2605/2615 2WD",333,367.13250000000005,14100573]
[14100595,"SUBF T1530",1034,1139.9850000000001,14100595]
[14100605,"SUBF LA/MC 25 SER",1034,1139.9850000000001,14100605]
[14100614,"SUBF LA/MC 55 SER",1034,1139.9850000000001,14100614]
[14100624,"SUBF LA/MC 30-35 SER",1034,1139.9850000000001,14100624]
[14100654,"SUBF KU L3200,3300",1034,1139.9850000000001,14100654]
[14100664,"SUBF KU B3200,3300",1034,1139.9850000000001,14100664]
[14100695,"SUBF S CM FOTON 354",1034,1139.9850000000001,14100695]
[14100705,"SUBF S CM FOTON 404-504",1034,1139.9850000000001,14100705]
[14110004,"GG BOOMER 4055",281,309.80250000000001,14110004]
[14110005,"GG BOOMER 1030",281,309.80250000000001,14110005]
[14110006,"GRILL GUARD KIT MF2605-2615 2WD",286,315.315,14110006]
[14110006,"GG MF 2605",281,309.80250000000001,14110006]
[14110007,"GG MA 5035",281,309.80250000000001,14110007]
[14110009,"GG MF",281,309.80250000000001,14110009]
[14110010,"GG MF GCS",281,309.80250000000001,14110010]
[14110013,"GG MA 5010",281,309.80250000000001,14110013]
[14110014,"GG T1530",281,309.80250000000001,14110014]
[14110016,"GG KIO CK37-35",281,309.80250000000001,14110016]
[14110021,"GG KU MX",281,309.80250000000001,14110021]
[14110022,"GG KIO CK20-22",281,309.80250000000001,14110022]
[14110023,"GG KIO DK40-55",281,309.80250000000001,14110023]
[14110024,"GG KIO DK55",281,{"$f":"C579*1.05*1.05","v":309.80250000000001},14110024]
[14110025,"GG MF 1533",281,309.80250000000001,14110025]
[14110026,"GG KU LSER",281,309.80250000000001,14110026]
[14110027,"GG JD 5045D",281,309.80250000000001,14110027]
[14110028,"GG KU LSER",281,309.80250000000001,14110028]
[14110029,"GRILL GUARD KIT FOTON 354",281,309.80250000000001,14110029]
[14110030,"GRILL GUARD KIT FOTON 404-504",281,309.80250000000001,14110030]
[14200003,"GRILL GUARD CNH TT3020-3040",286,315.315,14200003]
[14200004,"GRILL GUARD CNH TT TT60A-75A",286,315.315,14200004]
[14200010,"SUBF SET CASE FARMALL N",1553,1712.1825000000001,14200010]
[14200014,"SUBF S BM CNH WM 65,75/FARMALL",1553,1712.1825000000001,14200014]
[14200015,"SUBF SET BM MF 2650-2680",1553,1712.1825000000001,14200015]
[14200034,"SUBF SET BM KUBOTA M8540-9540",1553,1712.1825000000001,14200034]
[14200055,"SUBF SET BM MCCORMICK CX70-105",1553,1712.1825000000001,14200055]
[14200065,"SUBF SET BM MCCORM T-M/LAN 5H",1553,1712.1825000000001,14200065]
[14200074,"SUBF SET BM KUBOTA M5040-7040",1553,1712.1825000000001,14200074]
[14200084,"SUBF S BM CNH T5000/FARM U/JXU",1553,1712.1825000000001,14200084]
[14200094,"SUBF BM CNH T4040,4050/85C-95C",1553,1712.1825000000001,14200094]
[14200104,"SUBF BM CNH T4020,4030/65C-75C",1553,1712.1825000000001,14200104]
[14200114,"SUBF S BM CNH TD5040-50/ 90-95",1553,1712.1825000000001,14200114]
[14200117,"SUBFRAME SET CNH TD5050/TD95/JX95/Farmall 90/95",1553,1712.1825000000001,14200117]
[14200124,"SUBF S BM CNH TD5010-30/60-80",1553,1712.1825000000001,14200124]
[14200134,"SUBF SET BM JD 5E SERIES",1553,1712.1825000000001,14200134]
[14200154,"SUBF S BM CNH WM 45,55/FARMALL",1553,1712.1825000000001,14200154]
[14200174,"SUBF SET BM MF 2600-FWA",1553,1712.1825000000001,14200174]
[14200184,"SUBF SET BM MF 2615 2WD",1553,1712.1825000000001,14200184]
[14200195,"SUBF SET BM SAME DORADO 3 90",1553,1712.1825000000001,14200195]
[14200225,"SUBF SET BM SAME DORADO 60-80",1553,1712.1825000000001,14200225]
[14200245,"SUBF S BM DEUTZ AGROF 410-430",1553,1712.1825000000001,14200245]
[14200255,"SUBF SET BM SAME EXPLORER 95",1553,1712.1825000000001,14200255]
[14200284,"SUBF S BM DEUTZ AGROTR 80-100",1553,1712.1825000000001,14200284]
[14200285,"SUBF SET BM VALTRA A-SER",1553,1712.1825000000001,14200285]
[14200304,"SUBF SET BM MF 2625/35  2WD",1553,1712.1825000000001,14200304]
[14200305,"SUBF S BM DEUTZ AGROl 310-320",1553,1712.1825000000001,14200305]
[14200335,"SUBF SET BM MF 3600 STD",1553,1712.1825000000001,14200335]
[14200344,"SUBF S BM DEUTZ AGROTR K410-30",1553,1712.1825000000001,14200344]
[14200374,"SUBF SET BM KUBOTA M8540-9540",1553,1712.1825000000001,14200374]
[14200385,"SUBF S BM DEUTZ AGROFARM T",1553,1712.1825000000001,14200385]
[14200395,"SUBF S BM DEUTZ AGROFARM TB",1553,1712.1825000000001,14200395]
[14200445,"SUBF S BM CNH TDD/JX",1553,1712.1825000000001,14200445]
[14200455,"SUBF SET BM CNH TDD/JX 80-90",1553,1712.1825000000001,14200455]
[14200465,"SUBF S BM CNH TL75-100",1553,1712.1825000000001,14200465]
[14200485,"SUBF S BM CNH TN55D-75D/JX1060",1553,1712.1825000000001,14200485]
[14200487,"SUBF S BM CNH TN/TNA/TND/TNDA/",1553,1712.1825000000001,14200487]
[14200495,"SUBF S BM CNH T4020-4030 SS",1553,1712.1825000000001,14200495]
[14200507,"Farmall 75N, 95N",1553,1712.1825000000001,14200507]
[14200545,"SUBF SET BM MCCORMICK CX100",1553,1712.1825000000001,14200545]
[14200555,"SUBF SET BM LANDINI ALPINE 70-85",1553,1712.1825000000001,14200555]
[14200564,"SUBF SET BM JD 5M",1553,1712.1825000000001,14200564]
[14200575,"SUBF S BM ZETOR PROXIMA/PLUS",1553,1712.1825000000001,14200575]
[14200585,"SUBF SET BM C-MAX / POWERFARM",1553,1712.1825000000001,14200585]
[14200595,"SUBF SET BM McC,Land/5H, T-Max",1553,1712.1825000000001,14200595]
[14200604,"SUBF SET BM JD 6D",1553,1712.1825000000001,14200604]
[14200615,"SUBF SET BM MCC/LAND CL/TECH",1553,1712.1825000000001,14200615]
[14200694,"SUBF SET BM KUBOTA M95X-105X",1553,1712.1825000000001,14200694]
[14200704,"SUBF SET BM KUBOTA M100X-110X",1553,1712.1825000000001,14200704]
[14200805,"MCCORMICK X10.75M,90M SUBFRAME",1553,1712.1825000000001,14200805]
[14200824,"SUBFR SET BM CNH TT75",1553,1712.1825000000001,14200824]
[14200884,"SUBF SET BM JD 5425,5425N,5525",1553,1712.1825000000001,14200884]
[14200925,"SUBF SET BM MF 4225-4365",1553,1712.1825000000001,14200925]
[14200942,"SUBF REPAIR KIT MF2600 FWA",1553,1712.1825000000001,14200942]
[14201014,"SUBF SET BM CNH T4/FARMALL C",1553,1712.1825000000001,14201014]
[14201024,"SUBF SET BM CNH T4/FARMALL C",1553,1712.1825000000001,14201024]
[14201094,"JD 6000 - 6010 SUB 200 SERIES",1553,1712.1825000000001,14201094]
[14201115,"SUBF BM MCC X10.55",1553,{"$f":"C643*1.05*1.05","v":1712.1825000000001},14201115]
[14201175,"SUBF BM LANDINI REX 80/90/100/110",1553,1712.1825000000001,14201175]
[14201385,"SUBF BM ZETOR MAJOR 80",1553,1712.1825000000001,14201385]
[14220001,"GRILL GUARD KIT CNH WM 45,55",286,315.315,14220001]
[14220002,"GRILL GUARD KIT CNH WM 65,75",286,315.315,14220002]
[14220004,"GRILL GUARD KIT MF 2650-2680",286,315.315,14220004]
[14220005,"GRILL GUARD KIT SAME DORADO 3",286,315.315,14220005]
[14220006,"GRILL GUARD S DEUTZ AGROFARM",286,315.315,14220006]
[14220011,"GRILL GUARD KIT JD 5E",286,315.315,14220011]
[14220013,"GRILL GUARD KIT MF 3600",286,315.315,14220013]
[14220017,"GRILL GUARD MCCORM CX70-105",286,315.315,14220017]
[14220018,"GRILL GUARD KIT CNH T4000/FAR",286,315.315,14220018]
[14220021,"GRILL GUARD CNH TD5050/TD95/JX95/Farmall 90/95",286,315.315,14220021]
[14220030,"GRILL GUARD MCCORM CX100",286,315.315,14220030]
[14220032,"GRILL GUARD KIT JD 5M",286,315.315,14220032]
[14220034,"GRILL GUARD BM MCC/LAND",286,315.315,14220034]
[14220036,"GRILL GUARD KIT JD 6D",286,315.315,14220036]
[14220040,"GRILL GUARD BM MCC/LAND",286,315.315,14220040]
[14220043,"GRILL GUARD KIT CNH TDD/JX",286,315.315,14220043]
[14220044,"GRILL GUARD KIT BM KUBOTA 40-S",286,315.315,14220044]
[14220046,"GRILL GUARD CNH TN55D-75D/JX10",286,315.315,14220046]
[14220047,"GRILL GUARD KIT CNH TD5000/JX",286,315.315,14220047]
[14220048,"GRILL GUARD KIT CNH T5000/JXU",286,315.315,14220048]
[14220049,"GRILL GUARD KIT CNH T4000/65C-",286,315.315,14220049]
[14220050,"GRILL GUARD KIT CNH TDD/JX 80-",286,315.315,14220050]
[14220052,"GRILL GUARD KIT CNH TL70-100",286,315.315,14220052]
[14220053,"GRILL GUARD S KUBOTA M95X-105X",286,315.315,14220053]
[14220054,"GRILL GUARD S KUBOTA MX100-110",286,315.315,14220054]
[14220073,"GRILL GUARD KIT",286,315.315,14220073]
[14220078,"GRILL GUARD KIT MF 4225-4365",286,315.315,14220078]
[14220083,"GRILL GUARD KIT CNH T4/FARMALL",286,315.315,14220083]
[14220089,"JD 6000 - 6010 GRILL GUARD 200 SERIES",286,315.315,14220089]
[14220095,"GG MF 2625,35",281,309.80250000000001,14220095]
[14220096,"MCCORMICK X10.75M,90M GRILL GUARD",286,315.315,14220096]
[14220097,"MCCORMICK X10.55  GRILL GUARD",286,315.315,14220097]
[14310004,"SUBF SET DS NH TNF,TNFA",2219,2446.4475000000002,14310004]
[14310105,"SUBF SET DS LANDINI REX/MCCORM",2219,2446.4475000000002,14310105]
[14310324,"SUBFR SET DS CASE IH JXN",2219,2446.4475000000002,14310324]
[14310334,"SUBF SET DS NH TNF,TNFA",2219,2446.4475000000002,14310334]
[14310355,"SUBFR SET DS SAME DOR 86 TURBO",2219,2446.4475000000002,14310355]
[14310365,"SUBFR SET DS SAME DORADO 86",2219,2446.4475000000002,14310365]
[14310375,"SUBFR SET DS SAME DORADO 66",2219,2446.4475000000002,14310375]
[14310395,"SUBFR SET DS SAME DORADO 56,66",2219,2446.4475000000002,14310395]
[14310415,"SUBFR SET DS  DEUTZ AGROLUX",2219,2446.4475000000002,14310415]
[14310425,"SUBF SET DS LANDINI REX/MCCORM",2219,2446.4475000000002,14310425]
[14310444,"SUBF SET DS NH TNF,TNFA",2219,2446.4475000000002,14310444]
[14310475,"SUBFR SET DS SAME DOR 86 TURBO",2219,2446.4475000000002,14310475]
[14310495,"SUBFR SET DS SAME DORADO 76,86",2219,2446.4475000000002,14310495]
[14310505,"SUBFR SET DS SAME DORADO 66",2219,2446.4475000000002,14310505]
[14310515,"SUBFR SET DS SAME DORADO 56,66",2219,2446.4475000000002,14310515]
[14310565,"SUBFR SET DS SAME ARGON 55/70",2219,2446.4475000000002,14310565]
[14310595,"SUBFR SET DS SAME TIGER 50-70",2219,2446.4475000000002,14310595]
[14310605,"SUBF SET DS DEUTZ AGROLU 57-67",2219,2446.4475000000002,14310605]
[14310615,"SUBFR SET DS SAME DOR 86 TURBO",2219,2446.4475000000002,14310615]
[14310634,"SUBF SET DS CASE 75N,95N",2219,2446.4475000000002,14310634]
[14310644,"SUBFR SET DS KUBOTA M8540N",2219,2446.4475000000002,14310644]
[14310665,"LANDINI Rex 75, 85, 95, 105 F/GE Tier 2/3",2219,2446.4475000000002,14310665]
[14320005,"SUBFR SET NEWH TM/CASE-IH MXM",3049,3361.5225000000005,14320005]
[14320014,"SUBFR SET DM DEUTZ  AGROTRON",3049,3361.5225000000005,14320014]
[14320024,"SUBFR SET DEUTZ  AGROT 106-128",3049,3361.5225000000005,14320024]
[14320035,"SUBFR SET NEWH TM/CASE-IH MXM",3049,3361.5225000000005,14320035]
[14320044,"SUBFR SET DE CASE IH MX 100-17",3049,3361.5225000000005,14320044]
[14320084,"SUBFR SET DM JD 7610-7810",3049,3361.5225000000005,14320084]
[14320144,"SUBFR DM CASE MAXXUM 5130-5250",2596,2862.09,14320144]
[14320164,"SUBFR SET DM CASE MX 80-100/MC",2596,{"$f":"C707*1.05*1.05","v":2862.09},14320164]
[14320185,"SUBFR SET DM NEW H TS90-110",2596,2862.09,14320185]
[14320204,"SUBFR SET DM VALTRA C-SER",2596,2862.09,14320204]
[14320215,"SUBFR SET DM NEW H TM 115-165",3049,3361.5225000000005,14320215]
[14320225,"SUBFR SET DM NEW H TM 175,190",3049,3361.5225000000005,14320225]
[14320265,"SUBF S DM LANDINI LEG. 115-135",3049,3361.5225000000005,14320265]
[14320275,"SUBFR S DM LANDINI LEG 140-185",3049,3361.5225000000005,14320275]
[14320285,"SUBF S DM LANDINI MYTHOS 110",2596,2862.09,14320285]
[14320295,"SUBFR SET DM MF 6260-6290",2596,2862.09,14320295]
[14320354,"SUBFR SET DM JD 6010-6410",2219,2446.4475000000002,14320354]
[14320364,"SUBFR SET DM  JD 6506-7410",2596,2862.09,14320364]
[14320374,"SUBFR SET DM JD 6020L",2219,2446.4475000000002,14320374]
[14320385,"SUBFR SET DM JD 6603",2219,2446.4475000000002,14320385]
[14320395,"SUBFR SET DM MF6465-6480",2596,2862.09,14320395]
[14320415,"SUBFR SET DM MF6485-6495",3049,3361.5225000000005,14320415]
[14320435,"SUBFR S DM MF7465-7480DYNA-VT",2596,2862.09,14320435]
[14320445,"SUBFR SET DM MF7485-7495DYNA-V",3049,3361.5225000000005,14320445]
[14320455,"SUBFR SET DM MF 5465",2219,2446.4475000000002,14320455]
[14320505,"SUBF SET DM AGCO RT100-120 DYN",3049,3361.5225000000005,14320505]
[14320515,"SUBF SET DM AGCO RT100-120 CVT",3049,3361.5225000000005,14320515]
[14320555,"SUBFR SET DM VALTRA T-SERIES",3049,3361.5225000000005,14320555]
[14320575,"SUBFR SET DM VALTRA 6000-6850",2596,2862.09,14320575]
[14320585,"SUBFR SET DM VALTRA M-SERIES",2596,2862.09,14320585]
[14320615,"SUBFR SET DM VALTRA 8000",3049,3361.5225000000005,14320615]
[14320635,"SUBFR SET DM ZETOR 8641-11441",2596,2862.09,14320635]
[14320704,"SUBFR SET DM NH TS/CASE MXU/ST",2596,2862.09,14320704]
[14320714,"SUBFR SET NH TS115-135/CASE/ST",2596,2862.09,14320714]
[14320725,"SUBF SET DM NH M100-160",3049,3361.5225000000005,14320725]
[14320744,"SUBFR SET DM MCCORM MC115",2596,2862.09,14320744]
[14320754,"SUBFR SET DM MCCORM MC120-135",2596,2862.09,14320754]
[14320775,"SUBFR SET DM MF 5425-6455 STEE",2219,2446.4475000000002,14320775]
[14320785,"SUBF SET DM MF 5425-6470 STD",2219,2446.4475000000002,14320785]
[14320804,"SUBFR SET NH TSA 00,110 SU.STE",2596,2862.09,14320804]
[14320814,"SUBFR SET DM NEW H TS115-135A",2596,2862.09,14320814]
[14320855,"SUBF SET DM AGCO RT135-150 POW",3049,3361.5225000000005,14320855]
[14320865,"MF 6497, 6499 with DYNA VI TIER 2 (SISU)",3049,3361.5225000000005,14320865]
[14320884,"SUBF SET DEUTZ AGROTRON 80-100",2596,2862.09,14320884]
[14320895,"SUBF SET DM NEW H TB 100,110",2219,2446.4475000000002,14320895]
[14320905,"SUBF SET DM NEW H TB 120",2219,2446.4475000000002,14320905]
[14320915,"SUBF SET DM MF 4200,4300 4-CYL",2219,2446.4475000000002,14320915]
[14320925,"SUBF SET DM MF 4200,4300 6-CYL",2219,2446.4475000000002,14320925]
[14320945,"SUBF SET DM AGCO RT135-150 DYN",3049,3361.5225000000005,14320945]
[14320965,"SUBF SET CASE CX70-105/MCCORM",2219,2446.4475000000002,14320965]
[14320985,"SUBF SET DM ZETOR 11741",2596,2862.09,14320985]
[14321115,"SUBF SET DM AGCO LT75,LT90",2219,2446.4475000000002,14321115]
[14321124,"SUBF SET DM AGCO RT100-120",3049,3361.5225000000005,14321124]
[14321134,"SUBF SET DM AGCO RT135-150",3049,3361.5225000000005,14321134]
[14321145,"SUBF S DM CHALL MT555-565B",3049,3361.5225000000005,14321145]
[14321165,"SUBF S DM CHALL MT555-565B",3049,3361.5225000000005,14321165]
[14321215,"SUBF SET DM CNH TL/JX70U-100U",2219,2446.4475000000002,14321215]
[14321234,"SUBF SET DM KUBOTA M110-M125X",2219,2446.4475000000002,14321234]
[14321265,"SUBF SET DM MF 6445-6470 HEXAS",2596,2862.09,14321265]
[14321274,"SUBF SET DM KUBOTA M95S-105X",2219,2446.4475000000002,14321274]
[14321285,"SUBF S DM CNH TD75-90D/JX75-90",2219,2446.4475000000002,14321285]
[14321295,"SUBF S DM CNH TD55-70D/JX55-70",2219,2446.4475000000002,14321295]
[14321305,"SUBF SET DM MF 6465-6480",2596,2862.09,14321305]
[14321325,"SUBFR SET DM NEW H TN-SA",2219,2446.4475000000002,14321325]
[14321405,"SUBF SET DM MF 6445-6470 DYNA-",2596,2862.09,14321405]
[14321415,"SUBFR SET DM JD 6403",2219,2446.4475000000002,14321415]
[14321425,"SUBFR SET DM MF 491-492 ROPS",2219,2446.4475000000002,14321425]
[14321454,"SUBFR SET DM MF 431,461 ROPS",2219,2446.4475000000002,14321454]
[14321494,"DO-IT-YOURSELF KIT UPRIGHT DM",2219,2446.4475000000002,14321494]
[14321504,"SUBF SET DM KUBOTA M4700-6800",2219,2446.4475000000002,14321504]
[14321575,"SUBFR SET SAME 115,130/LAMBORG",2596,2862.09,14321575]
[14321585,"SUBF SET DM NEW H TN,TNA",2219,{"$f":"C771*1.05*1.05","v":2446.4475000000002},14321585]
[14321644,"SUBF SET DM KUBOTA M8200,M9000 2WD",2219,2446.4475000000002,14321644]
[14321674,"SUBFR SET DM MF 251XE,451",2219,2446.4475000000002,14321674]
[14321684,"SUBFR SET DM MF 425-481 ROPS",2219,2446.4475000000002,14321684]
[14321695,"SUBFR SET DM VALTRA  A-SER",2219,2446.4475000000002,14321695]
[14321704,"SUBF SET DM KUBOTA M95S-105X",2219,2446.4475000000002,14321704]
[14321714,"SUBF SET DM KUBOTA M9000 4WD",2219,2446.4475000000002,14321714]
[14321734,"SUBFR SET DM FENDT 400-SERIES",2596,2862.09,14321734]
[14321814,"SUBFR SET DM MF 425,481 CAB",2219,2446.4475000000002,14321814]
[14321835,"SUBFR SET DM SAME EXPL CLASSIC",2596,2862.09,14321835]
[14321925,"SUBFR SET DM MF6235-6565",2219,2446.4475000000002,14321925]
[14321935,"SUBFR SET DM MF6235-6565 STEEP",2219,2446.4475000000002,14321935]
[14321955,"SUBFR S DM LANDINI/MCCO 75-105",2219,2446.4475000000002,14321955]
[14321964,"SUBFR SET DM JD 5225-5325",2219,2446.4475000000002,14321964]
[14321975,"SUBFR SET DM MF 491-492 CAB",2219,2446.4475000000002,14321975]
[14321985,"SUBFR SET DM SAME SILV 105",2596,2862.09,14321985]
[14321994,"SUBF S DM CNH TN-A,TND-A,JXC",2219,2446.4475000000002,14321994]
["14321994-","SUBF S DM CNH TN-A,TND-A,JXC",2219,2446.4475000000002,"14321994-"]
[14321996,"ADD.KIT  CNH TN-A,TND-A,JXC",0,0,14321996]
[14322045,"SUBFR SET DM SAME EXPL 85,95",2219,2446.4475000000002,14322045]
[14322065,"SUBFR S DM MCCORM C-MAX 75-105",2219,2446.4475000000002,14322065]
[14322074,"SUBFR S DM MF 3435-3455 S&F",2219,2446.4475000000002,14322074]
[14322084,"SUBFR SET DM DEUTZ  AGROTRON",2596,2862.09,14322084]
[14322105,"SUBFR S DM LANDINI 60 / MCCORM",2219,2446.4475000000002,14322105]
[14322155,"SUBFRAME SET MF5465-5475 TIER3",2596,2862.09,14322155]
[14322165,"SUBFR SET DM SAME EXPL 85T,95T",2219,2446.4475000000002,14322165]
[14322175,"SUBFR  DM SAME EXPL CLASSIC 75",2219,2446.4475000000002,14322175]
[14322185,"SUBFR SET DM SAME SILV 85-110",2596,2862.09,14322185]
[14322205,"SUBFR SET DM MCCOR C-4wd BLACK",2219,2446.4475000000002,14322205]
[14322244,"SUBFR SET DM MCCOR C-2wd BLACK",2219,2446.4475000000002,14322244]
[14322295,"SUBF S CASE/STEYR JX1085-95C",2219,2446.4475000000002,14322295]
[14322297,"SUBFR SET DM CNH TNA/TNDA/JXC",2219,2446.4475000000002,14322297]
[14322305,"SUBFR SET DM LANDINI 125,135",3049,3361.5225000000005,14322305]
[14322325,"LT \"A\" 75, 90 Speed Shift",2219,2446.4475000000002,14322325]
[14322334,"SUBFR SET DM VALTRA N-SERIES",2596,2862.09,14322334]
[14322345,"SUBF S DM AGCO RT100-120A CVT",3049,3361.5225000000005,14322345]
[14322355,"SUBF SET DM AGCO RT100-120A",3049,3361.5225000000005,14322355]
[14322364,"SUBFR SET DM JD 5425-5525",2219,2446.4475000000002,14322364]
[14322395,"SUBFR SET DM MF 5425-5455 N.AM",2219,2446.4475000000002,14322395]
[14322435,"SUBFR SET DM LANDINI VISION",2596,2862.09,14322435]
[14322454,"SUBFR S DM MF 3615-3645",2219,2446.4475000000002,14322454]
[14322465,"RT 165A AUTO VI Tier 3 Serial # <T176049",3049,3361.5225000000005,14322465]
[14322475,"SUBF S DM CASE JX-C/STEYR COMP",2219,2446.4475000000002,14322475]
[14322505,"SUBFR SET DM ZETOR 6441-8441",2219,2446.4475000000002,14322505]
[14322525,"SUBFR SET DM NEW H TN-85SA",2219,2446.4475000000002,14322525]
[14322535,"SUBFR S DM DEUTZ  AGROPL 75-95",2219,2446.4475000000002,14322535]
[14322544,"SUBF S DM DEUTZ AGROTR 80-100",2219,2446.4475000000002,14322544]
[14322565,"SUBFR S DM LAND ALP/MCCORM CX-",2219,2446.4475000000002,14322565]
[14322604,"SUBF SET DM KUBOTA M8540-9540",2219,2446.4475000000002,14322604]
[14322625,"SUBF S DM MF 5425-6460 STD DYN",2219,2446.4475000000002,14322625]
[14322645,"SUBF S DM MF5425-6470 STD DYNA",2219,2446.4475000000002,14322645]
[14322675,"SUBFR SET DM MCCORM CX BLACK",2219,2446.4475000000002,14322675]
[14322715,"SUBFR S DM LANDINI/MCCO 75-105",2219,2446.4475000000002,14322715]
[14322734,"SUBF SET DM KUBOTA M5040-7040",2219,2446.4475000000002,14322734]
[14322745,"SUBF SET DM NEW H TN-D,TN-DA",2219,2446.4475000000002,14322745]
[14322765,"SUBFR SET DM LANDINI / MCCORM",2219,2446.4475000000002,14322765]
[14322774,"SUBFR S DM DEUTZ  AGROTR K-110",3049,3361.5225000000005,14322774]
[14322805,"SUBFR SET DM NH TN85-95DA",2219,2446.4475000000002,14322805]
[14322815,"SUBF S DM AGCO LT75-90A AUTO-",2219,2446.4475000000002,14322815]
[14322824,"SUBFR S DM DEUTZ AGROT K90-120",2596,2862.09,14322824]
[14322834,"SUBF SET DM CNH TM/MXM 120-190",3049,3361.5225000000005,14322834]
[14322836,"REAR MOUNT BRACKET CNH TM/MXM",0,0,14322836]
[14322854,"SUBF S DM CNH TSA/MXU 100,110",2596,2862.09,14322854]
[14322856,"REAR MOUNT BRACKET CNH TSA/MXU",742,818.05500000000006,14322856]
[14322864,"SUBF SET DM CNH TSA/MXU 6-CYL",2596,{"$f":"C835*1.05*1.05","v":2862.09},14322864]
[14322866,"REAR MOUNT BRACKET CNH TSA/MXU",742,818.05500000000006,14322866]
[14322874,"SUBFR SET DM DEUTZ  AGRO 180.7",3049,3361.5225000000005,14322874]
[14322894,"SUBF SET DM CNH TDD/JX 55-70",2219,2446.4475000000002,14322894]
[14322896,"REAR MOUNT BRACKET CNH TDD,JX",742,818.05500000000006,14322896]
[14322904,"SUBF S DM CNH TDD/JX 75-90",2219,2446.4475000000002,14322904]
[14322914,"SUBF S CNH TNA/TNDA85,95/JXC",2219,2446.4475000000002,14322914]
[14322916,"REAR MOUNT BRACKET CNH TNA,JXC",742,818.05500000000006,14322916]
[14322924,"SUBF SET DM CNH TDD/JX95",2219,2446.4475000000002,14322924]
[14322975,"SUBFR SET DM NEW H TN-S,TN-SA",2219,2446.4475000000002,14322975]
[14323015,"SUBFR SET LAND MYTHOS 90-105",2219,2446.4475000000002,14323015]
[14323025,"SUBFR SET DM LANDINI 145-185",3049,3361.5225000000005,14323025]
[14323034,"SUBF S DM CNH T7000 / PUMA",3049,3361.5225000000005,14323034]
[14323036,"REAR MOUNT BRACKET T7000-PUMA",742,818.05500000000006,14323036]
[14323045,"SUBF SET DM BELARUS 505-862",2219,2446.4475000000002,14323045]
[14323084,"SUBF SET DM NH TN75SA",2219,2446.4475000000002,14323084]
[14323095,"SUBF SET DM BELARUS 505-1082",2219,2446.4475000000002,14323095]
[14323104,"SUBF SET DM CNH TL/JXU",2219,2446.4475000000002,14323104]
[14323125,"SUBR DM MF7465-7480",2596,2862.09,14323125]
[14323135,"RT \"A\" 110, 120 TIER 3 CVT",3049,3361.5225000000005,14323135]
[14323145,"RT \"A\" 110, 120 TIER 3 Auto VI",3049,3361.5225000000005,14323145]
[14323264,"SUBFR SET DM JD 5003",2219,2446.4475000000002,14323264]
[14323274,"SUBF SET DM CNH CNH T6000/PUMA",3049,3361.5225000000005,14323274]
[14323276,"REAR MOUNT BRACKET CNH APH07",742,818.05500000000006,14323276]
[14323284,"SUBF SET DM CNH TLA/JXU",2219,2446.4475000000002,14323284]
[14323286,"REAR MOUNT BRACKET CNH TLA,JXU",742,818.05500000000006,14323286]
[14323287,"SUBF SET DM CNH TLA/JXU",2219,2446.4475000000002,14323287]
[14323295,"RT \"A\" 140, 155 TIER 3 Auto VI",3049,3361.5225000000005,14323295]
[14323305,"RT \"A\" 140, 155 TIER 3 CVT",3049,3361.5225000000005,14323305]
[14323315,"SUBFR SET MT555B - 575B T3 AUTO VI",3049,3361.5225000000005,14323315]
[14323325,"SUBF S DM CHALLE MT555-75B CVT",2596,2862.09,14323325]
[14323344,"SUBF SET DM KUBOTA M96S-108S",2219,2446.4475000000002,14323344]
[14323354,"SUBF SET DM CNH TSA/MXU 4-CYL",2596,2862.09,14323354]
["14323354-","SUBF SET DM CNH TSA/MXU 4-CYL",2596,2862.09,"14323354-"]
[14323364,"SUBF SET DM CNH TSA/MXU 6-CYL",2596,2862.09,14323364]
["14323364-","SUBF SET DM CNH TSA/MXU 6-CYL",2596,2862.09,"14323364-"]
[14323365,"SUBFRAME SET T4020-30 SUPERSTEER",2219,2446.4475000000002,14323365]
[14323414,"SUBFR SET DM JD 7430-7530",2596,2862.09,14323414]
[14323464,"SUBFR SET DM JD 5005",2219,2446.4475000000002,14323464]
[14323535,"SUBFR S DM SAME EXPL.3 85,100",2219,2446.4475000000002,14323535]
[14323545,"SUBFR S DM LAND ALP/MCCORM CX-",2219,2446.4475000000002,14323545]
[14323575,"SUBFR SET DM LANDINI / MCCORM",2219,2446.4475000000002,14323575]
[14323595,"SUBFR SET DM MF 573-583",2219,2446.4475000000002,14323595]
[14323605,"SUBFR SET DM LANDINI LANDPOWER",3049,3361.5225000000005,14323605]
[14323661,"GRILL GUARD KIT MF 5400 STEP N",235,259.08750000000003,14323661]
[14323674,"SUBF S DM VALTRA SMALL N-SER",2219,2446.4475000000002,14323674]
[14323695,"SUBF S DM LAND TECH/MCCOR CL",2219,2446.4475000000002,14323695]
[14323744,"SUBFR S DM MF 3625-3655 MOD F",2219,2446.4475000000002,14323744]
[14323758,"SUBF SET DM CNH TLA/JXU",2219,2446.4475000000002,14323758]
[14323765,"Subframe Set T4020-30",2219,2446.4475000000002,14323765]
[14323766,"REAR BRACKET CNH T4020,30/FARM",742,818.05500000000006,14323766]
[14323768,"SUBF S DM CNH T4020-30/ 65-75C",2219,2446.4475000000002,14323768]
[14323805,"SUBF SET DM ZETOR PROXIMA PLUS",2219,2446.4475000000002,14323805]
[14323815,"SUBF SET DM MF 6110-6140",2219,2446.4475000000002,14323815]
[14323825,"SUBF SET DM MF3150-6140 STEEPN",2219,2446.4475000000002,14323825]
[14323835,"SUBF SET DM MF 6160-6180",2596,2862.09,14323835]
[14323905,"SUBF SET DM ZETOR FORTERA",2219,2446.4475000000002,14323905]
[14323916,"REAR MOUNT BRACKET CNH TDD/FAR",742,818.05500000000006,14323916]
[14323918,"SUBF DM CNH TD5050/FARM 90,95",2219,2446.4475000000002,14323918]
[14323938,"SUBF S CNH T4040,4050/ 85C,95C",2219,2446.4475000000002,14323938]
[14323955,"SUBF SET DM CNH T5000/JXU",2219,2446.4475000000002,14323955]
[14323958,"SUBF S CNH T5030-60/ 85U-105U",2219,2446.4475000000002,14323958]
[14323968,"SUBF S DM CNH T4020-30 S STEER",2219,2446.4475000000002,14323968]
[14323978,"SUBF SET DM CNH T4040,4050",2219,2446.4475000000002,14323978]
[14324025,"SUBFR SET DM CNH T4000/QUA/KOM",2219,{"$f":"C899*1.05*1.05","v":2446.4475000000002},14324025]
[14324045,"SUBFRAME SET T4040-50 SUPERSTEER",2219,2446.4475000000002,14324045]
[14324054,"SUBFR SET DM MCCORM MC120,130",2596,2862.09,14324054]
[14324064,"SUBF SET DM DEUTZ  AGROTR M650",3049,3361.5225000000005,14324064]
[14324084,"SUBF SET DM DEUTZ  AGROTR M640",3049,3361.5225000000005,14324084]
[14324124,"SUBFR SET DM SAME DEUTZ-FAHR",3049,3361.5225000000005,14324124]
[14324155,"SUBF S DM LANDINI LAND 125-135",3049,3361.5225000000005,14324155]
[14324194,"SUBF SET DM KUBOTA M95S-105X",2219,2446.4475000000002,14324194]
[14324248,"SUBF SET DM CNH TD5010-5030",2219,2446.4475000000002,14324248]
[14324255,"SUBFR SET DM FORD/NH 5640-7740",2219,2446.4475000000002,14324255]
[14324265,"SUBFR SET DM FORD/NH 7840-8340",2596,2862.09,14324265]
[14324324,"SUBFR SET DM JD 6230-6430 NA",2219,2446.4475000000002,14324324]
[14324334,"SUBFR SET DM JD 7130-7430 NA",2596,2862.09,14324334]
[14324354,"SUBFR SET DM MCCORM MC 120-135",2596,2862.09,14324354]
[14324364,"SUBFR SET NH TS6000",2596,2862.09,14324364]
[14324425,"SUBF S DM MF5425-6455 STD DYNA",2219,2446.4475000000002,14324425]
[14324465,"SUBF DM LANDINI LANDP 145-180",3049,3361.5225000000005,14324465]
[14324585,"SUBF S DM SAME EXPL 3/AGROFARM",2219,2446.4475000000002,14324585]
[14324615,"SUBF S DM LANDINI POWERMONDIAL",2596,2862.09,14324615]
[14324625,"SUBF SET DM MCCORM CX 110",2219,2446.4475000000002,14324625]
[14324684,"SUBF SET DM KUBOTA M126X-135X",2596,2862.09,14324684]
[14324705,"SUBFR S DM MF 3600-SER STD",2219,2446.4475000000002,14324705]
[14324725,"SUBF SET CNH TD5040-50/JX90,95",2219,2446.4475000000002,14324725]
[14324725,"SUBFR SET NH TD 5040-5050",2219,2446.4475000000002,14324725]
[14324755,"SUBFR S DM LANDINI/MCCORM C-MA",2219,2446.4475000000002,14324755]
[14324785,"SUBF SET DM ZETOR PROXIMA PLUS",2219,2446.4475000000002,14324785]
[14324795,"SUBFR SET DM LANDINI VISION",2219,2446.4475000000002,14324795]
[14324814,"SUBFR SET DM JD 6D SERIES",2219,2446.4475000000002,14324814]
[14324824,"SUBFR SET DM JD 5425-5525",2219,2446.4475000000002,14324824]
[14324834,"SUBFR SET DM JD 5225-5325",2219,2446.4475000000002,14324834]
[14324874,"SUBF SET DM TS115A",2596,2862.09,14324874]
[14324905,"SUBFR S DM LAND ALP/MCCORM CX-",2219,2446.4475000000002,14324905]
[14324914,"SUBF SET DM KUBOTA M100X-110X",2219,2446.4475000000002,14324914]
[14324924,"SUBFR SET DM JD 5M",2219,2446.4475000000002,14324924]
[14324964,"SUBFR SET DM MCCORM MC 120-135",2596,2862.09,14324964]
[14324974,"SUBFRAME JD 2350-2755",2219,2446.4475000000002,14324974]
[14325074,"SUBFR SET T7000 DM",3049,3361.5225000000005,14325074]
[14325074,"SUBF SET DM CNH T7 TIER 4 LWB",3049,3361.5225000000005,14325074]
[14325078,"SUBF S DM CNH T7/ PUMA LWB",2596,2862.09,14325078]
[14325085,"SUBF S DM DORADO 90",2219,2446.4475000000002,14325085]
[14325095,"SUBF S DM DORADO 60,80",2219,2446.4475000000002,14325095]
[14325135,"SUBFR SET DM VALTRA  A-SER",2219,2446.4475000000002,14325135]
[14325164,"SUBFR SET DM JD 5 E-SERIES",2219,2446.4475000000002,14325164]
[14325225,"SUBFR SET DM LANDINI / MCCORM",2219,2446.4475000000002,14325225]
[14325245,"SUBF SET DM MF 2650-2680",2219,2446.4475000000002,14325245]
[14325264,"SUBF SET DM DEUTZ  AGROTR M400",2596,2862.09,14325264]
[14325284,"SUBFR SET DM VALTRA N-SERIES",2596,2862.09,14325284]
[14325294,"SUBFR SET DM VALTRA  N-SER",2596,2862.09,14325294]
[14325324,"SUBFR SET DM JD 5M",2219,2446.4475000000002,14325324]
[14325335,"Agrofarm 410T and 420T",2219,2446.4475000000002,14325335]
[14325345,"Agrofarm 410TB and 420TB",2219,2446.4475000000002,14325345]
[14325485,"SUBFRAME FARMALL 70 80",2219,2446.4475000000002,14325485]
[14325495,"Subframe Deutz Agroplus",2219,2446.4475000000002,14325495]
[14325505,"SUBFR SET DORADO 90",2219,2446.4475000000002,14325505]
[14325515,"SUBFR SET RT \"A\" 140, 155 TIER 3 CVT",3049,3361.5225000000005,14325515]
[14325525,"SUBFR SET AGCO RT 100-120A CVT",3049,3361.5225000000005,14325525]
[14325535,"SUBFR SET AGCO RT 100-120A Auto VI",3049,3361.5225000000005,14325535]
[14325584,"SUBFR SET DM FENDT 700-800",3049,3361.5225000000005,14325584]
[14325755,"SUBFR S DM MF 3600-SER STD",2219,2446.4475000000002,14325755]
[14325765,"SUBF SET MCCORMICK X60",2219,2446.4475000000002,14325765]
[14325795,"MF 2670, 2680",2219,2446.4475000000002,14325795]
[14325814,"Agrotron M410 and M420",3049,3361.5225000000005,14325814]
[14325824,"SUBFR SET DM FENDT 700-724 VAR",3049,3361.5225000000005,14325824]
[14325845,"SUBFR SET NH TD 5020-5030",2219,2446.4475000000002,14325845]
[14325884,"SUBF SET DM NH T4/CASE FARMALL",2219,{"$f":"C963*1.05*1.05","v":2446.4475000000002},14325884]
[14325894,"SUBF SET DM JD 6170R-6210R",2596,2862.09,14325894]
[14325925,"SUBFRAME LANDINI 5H",2219,2446.4475000000002,14325925]
[14325964,"SUBF SET JD 5425-5525, 5603,",2219,2446.4475000000002,14325964]
[14326104,"SUBF DM KUBOTA M126GX-135GX",2596,2862.09,14326104]
[14326114,"SUBFR SET DM CASE 5120",2219,2446.4475000000002,14326114]
[14326154,"SUBF DM JD 6170-6210R",2596,2862.09,14326154]
[14326225,"SUBF DM MF 7465-7480",2596,2862.09,14326225]
[14326235,"SUBF DM MF 6465-80",2596,2862.09,14326235]
[14326245,"SUBF DM MF 5465-5475",2596,2862.09,14326245]
[14326304,"Agrotron 6180,90",3049,3361.5225000000005,14326304]
[14326314,"SUBF DM JD 6140-6150R",2596,2862.09,14326314]
[14326324,"SUBF DM JD 6140-6150R",2596,2862.09,14326324]
[14326354,"JD 6105R - 6130R SUBRAME",2596,2862.09,14326354]
[14326364,"JD 6105R - 6130R SUBRAME - FRT HITCH",2596,2862.09,14326364]
[14326374,"M100GXDTCC, M110GXDTCC",2596,2862.09,14326374]
[14326394,"Deutz 6150,60",2596,2862.09,14326394]
[14326485,"SUBF MCCORMICK X50",2219,2446.4475000000002,14326485]
[14326664,"Subframe Set 5100-5130 DZ",2219,2446.4475000000002,14326664]
[14326695,"SUBFR S DM MF 3600/MT300B SER",2219,2446.4475000000002,14326695]
[14326724,"SUBFR SET DM KUB. M100-110GX",2219,2446.4475000000002,14326724]
[14326744,"SUBR SET DEUTZ AGROTRON",3049,3361.5225000000005,14326744]
[14326774,"SUBFR SET MCCORM XTX 145-165",3049,3361.5225000000005,14326774]
[14326874,"SUBF DM MF 4600",2219,2446.4475000000002,14326874]
[14327064,"SUBFR SET JD 5E-SERIES",2219,2446.4475000000002,14327064]
[14327064,"SUBFR SET JD 5045E-5075R",2219,2446.4475000000002,14327064]
[14327084,"SUBF DM JD5085E",2219,2446.4475000000002,14327084]
[14327134,"Deutz 6150.4,60.4",2596,2862.09,14327134]
[14327165,"SUBFRAME DEUTZ AGROLUX",2219,2446.4475000000002,14327165]
[14327255,"SUBFR SET DM SAME DORADO 76-86",2219,2446.4475000000002,14327255]
[14327324,"SUBFR SET JD 6105-6130",2596,2862.09,14327324]
[14327564,"SUBFR SET DM FENDT 700-724 VAR",3049,3361.5225000000005,14327564]
[14330004,"SUBF SET DL JD 7720-7920",3643,4016.4075000000003,14330004]
[14330024,"SUBF SET DL NEW H TG",3643,4016.4075000000003,14330024]
[14330034,"SUBF SET DL NEW H TG SUPER STE",3643,4016.4075000000003,14330034]
[14330044,"SUBFR SET DL CASE MX 180-275",3643,4016.4075000000003,14330044]
[14330115,"SUBF SET DL MF 8450-8480",3643,4016.4075000000003,14330115]
[14330135,"SUBF SET DL NEW H G/BULER VERS",3643,4016.4075000000003,14330135]
[14330145,"SUBFR SET DL FENDT 900 STD",3643,4016.4075000000003,14330145]
[14330155,"SUBFR SET DL FENDT 900 FR.HI",3643,4016.4075000000003,14330155]
[14330225,"SUBFR SET DL VALTRA T-SERIES",3643,4016.4075000000003,14330225]
[14330844,"DO-IT-YOURSELF KIT UL TO DL",2219,2446.4475000000002,14330844]
[14330854,"SUBF SET DL CASE MX MAGNUM",3643,4016.4075000000003,14330854]
[14330864,"SUBF SET DL CNH TG STANDARD",3643,4016.4075000000003,14330864]
[14330874,"SUBF SET DL CNH TG SUPERSTEER",3643,4016.4075000000003,14330874]
[14330895,"SUBF SET DL LANDINI POWERMASTE",3643,4016.4075000000003,14330895]
[14330924,"SUBF SET DL CASE 7110-7250 MAG",3643,4016.4075000000003,14330924]
[14330965,"RT 165A, RT 180A AUTO VI Tier 3 ",3643,4016.4075000000003,14330965]
[14331024,"SUBF SET DL CASE MAGNUM / MX",3643,4016.4075000000003,14331024]
[14331034,"SUBF SET DL JD 8000-8010",3643,4016.4075000000003,14331034]
[14331054,"DT205 - 275 B",3643,4016.4075000000003,14331054]
[14331095,"Agrotron TTV 630",3643,4016.4075000000003,14331095]
[14331105,"RT 165A, RT 180A Tier 3 CVT",3643,4016.4075000000003,14331105]
[14331124,"SUBFR SET DL JD 7R",3643,4016.4075000000003,14331124]
[14331175,"SUBFRAME Deutz TTV 630, 7210-7275",3643,4016.4075000000003,14331175]
[14340024,"SUBF SET DXL JD 8R",4298,4738.545000000001,14340024]
[14340034,"SUBF SET DXL JD 8R ",4298,4738.545000000001,14340034]
[14400563,"REAR EXT. MF 2605/2615 2WD",333,367.13250000000005,14400563]
[50035035,"GG KU 3200,3300",281,309.80250000000001,50035035]
[50035527,"GG BOOMER 3045",281,309.80250000000001,50035527]
[50062947,"GG BOOMER 30-45",281,309.80250000000001,50062947]
[50065795,"GRILL GUARD KIT",281,309.80250000000001,50065795]
[50100767,"SKID STEER QUICK ATTACH SYSTEM",993,1094.7825000000003,50100767]
["10378005A","HOSE KIT BASIC LCS",530,584.32500000000005,"10378005A"]
["10378047D","HOSE KIT SPECIAL LCS",530,{"$f":"C1027*1.05*1.05","v":584.32500000000005},"10378047D"]
["10378096D","HOSE KIT SPECIAL LCS",530,584.32500000000005,"10378096D"]
["10378133D","HOSE KIT SPECIAL LCS",530,584.32500000000005,"10378133D"]
["10378134C","HOSE KIT DELUXE LCS",1237,1363.7925000000002,"10378134C"]
["10378137D","HOSE KIT SPECIAL LCS",530,584.32500000000005,"10378137D"]
["10378141M","HYDRAULIC SET CNH",639,704.49750000000006,"10378141M"]
["10378178C","HOSE KIT DELUXE LCS",1237,1363.7925000000002,"10378178C"]
["10378209D","HOSE KIT SPECIAL LCS",530,584.32500000000005,"10378209D"]
["10378214D","HOSE KIT SPECIAL LCS",530,584.32500000000005,"10378214D"]
["10378216D","HOSE KIT SPECIAL LCS",530,584.32500000000005,"10378216D"]
["10378216M","HOSE KIT SPECIAL LCS JD",639,704.49750000000006,"10378216M"]
["10378218C","HOSE KIT DELUXE LCS",1237,1363.7925000000002,"10378218C"]
["10378224D","HOSE KIT SPECIAL LCS",530,584.32500000000005,"10378224D"]
["10378232C","HOSE KIT DELUXE LCS",1237,1363.7925000000002,"10378232C"]
["10378236D","HOSE KIT SPECIAL LCS",530,584.32500000000005,"10378236D"]
["10378237M'","3 FCTN HOSE KIT - NH T6000",639,704.49750000000006,"10378237M"]
["10378252A","HOSE KIT REMOTES LCS",530,584.32500000000005,"10378252A"]
["10378264D","2 Function Hose Kit",530,584.32500000000005,"10378264D"]
["10378266M","HOSE KIT SPECIAL LCS",638,703.39499999999998,"10378266M"]
["10378269C","HOSE KIT DELUXE LCS",1237,1363.7925000000002,"10378269C"]
["10378270C","HOSE KIT DELUXE LCS",1237,1363.7925000000002,"10378270C"]
["10378271C","HOSE KIT DELUXE LCS",1237,1363.7925000000002,"10378271C"]
["10378272C","HOSE KIT DELUXE LCS",1237,1363.7925000000002,"10378272C"]
["10378273C","HOSE KIT DELUXE LCS",1237,1363.7925000000002,"10378273C"]
["10378277M'","HOSE KIT SPECIAL LCS JD",639,704.49750000000006,"10378277M"]
["10378287C","HOSE KIT DELUXE LCS",1237,1363.7925000000002,"10378287C"]
["10378307C","HOSE KIT DELUXE LCS",1237,1363.7925000000002,"10378307C"]
["10378315D","HOSE KIT SPECIAL LCS FENDT",639,704.49750000000006,"10378315D"]
["10378301B","HOSE KIT SPECIAL LCS DEUTZ",530,584.32500000000005,"10378316B"]
["10378316B","HOSE KIT SPECIAL LCS DEUTZ",530,584.32500000000005,"10378316B"]
["10378318C","HOSE KIT DELUXE LCS",1237,1363.7925000000002,"10378318C"]
["10378337D","HOSE KIT SPECIAL LCS CNH",530,584.32500000000005,"10378337D"]
["10378345C","HOSE KIT DELUXE LCS",1237,1363.7925000000002,"10378345C"]
["10378366C","HOSE KIT DELUXE LCS",1237,1363.7925000000002,"10378366C"]
["10378369D","HOSE KIT SPECIAL LCS MF4600",530,584.32500000000005,"10378369D"]
["10830555F","HOOKS SET (PAIR)",232,255.78000000000003,"10830555F"]
["10834140F","BUCKET TINE SET, ONE TINE",112,123.48000000000002,"10834140F"]
["10834142F","BUCKET TINE SET",94,103.63500000000001,"10834142F"]
["10834350F","GRAPPLE CLAW",147,162.0675,"10834350F"]
["11208073F","*LIFT ARM",1298,1431.0450000000001,"11208073F"]
["11209682F","FLEXIBAL BALE SUPPORT",809,891.92250000000013,"11209682F"]
["11209714F","BOLT-ON ATTACHMENT SET EURO 8",299,329.64749999999998,"11209714F"]
["11209793F","SILOSPLIT HD",1622,1788.2550000000001,"11209793F"]
["11209904F","BALE SPLIT STANDARD",1133,1249.1325000000002,"11209904F"]
["11215019F","EXTENSION SET BALE FORK",265,292.16250000000002,"11215019F"]
["11215030F","*BALE SPIKE ATTACHMENT - OLD STYLE",667,735.36750000000006,"11215030F"]
["11250144F","HY-TIP BUCKET 230 EURO",6443,7103.4075000000012,"11250144F"]
["11250178F","UNIGRIP 130",2447,2697.8175000000001,"11250178F"]
["11250358F","Quadrogrip 200",4679,5158.5974999999999,"11250358F"]
["11250533F","MAXI GRAPPLE 210",5586,6158.5650000000005,"11250533F"]
["11250534F","MAXI GRAPPLE 240",5946,6555.4650000000001,"11250534F"]
["11250535F","MAXI GRAPPLE 260",6299,6944.6475000000009,"11250535F"]
["11250536F","MAXI GRAPPLE 210T WITH TINES",5746,6334.9650000000001,"11250536F"]
["11250537F","MAXI GRAPPLE 240T WITH TINES",6105,6730.7625000000007,"11250537F"]
["11250538F","MAXI GRAPPLE 260T WITH TINES",6587,7262.1675000000005,"11250538F"]
["11250633F","LOG GRAB - OLD STYLE",1903,2098.0575000000003,"11250633F"]
["11250654F","MAXI GRAPPLE 210 - BUCKET ONLY",2468,2720.9700000000003,"11250654F"]
["11250655F","MAXI GRAPPLE 240 - BUCKET ONLY",3007,3315.2175000000002,"11250655F"]
["11250656F","MAXI GRAPPLE 260 - BUCKET ONLY",3300,3638.25,"11250656F"]
["11250657F","GRAPPLE ASSEMBLY KIT",3398,3746.2950000000001,"11250657F"]
["11250658F","SILOCUT 120 SE EURO(8)",6497,7162.942500000001,"11250658F"]
["11250668F","SILOCUT 150 SE EURO(8)",6973,7687.732500000001,"11250668F"]
["11250673F","UTILITY GRAPPLE",3254,3587.5350000000003,"11250673F"]
["11250678F","SILOCUT 190 SE EURO(8)",8648,9534.42,"11250678F"]
["11250688F","SILOCUT 230 SE EURO(8)",8899,{"$f":"C1091*1.05*1.05","v":9811.1475000000009},"11250688F"]
["11250728F","POWERGRAB 185",5763,6353.7075000000004,"11250728F"]
["11250738F","POWERGRAB 210",6181,6814.5525000000007,"11250738F"]
["11250748F","POWERGRAB 240",6600,7276.5,"11250748F"]
["11250758F","POWERGRAB 260",7230,7971.0750000000007,"11250758F"]
["11250768F","FLEXIBAL ",2671,2944.7775000000001,"11250768F"]
["11250788F","UNIGRIP 160",2566,2829.0150000000003,"11250788F"]
["11250818F","MULTIBENNE 130  EURO",3363,3707.7075000000004,"11250818F"]
["11250828F","MULTIBENNE 150 EURO",3497,3855.4425000000006,"11250828F"]
["11250838F","MULTIBENNE 170 EURO",3753,4137.6824999999999,"11250838F"]
["11250848F","MULTIBENNE 190 EURO",4266,4703.2650000000003,"11250848F"]
["11250858F","MULTIBENNE 210 EURO",4521,4984.4025000000001,"11250858F"]
["11250868F","MULTIBENNE 230 EURO",4777,5266.6425000000008,"11250868F"]
["11250878F","MULTIBENNE 250 EURO",5505,6069.2624999999998,"11250878F"]
["11250888F","SILOGRAB 130 EURO",2762,3045.105,"11250888F"]
["11250898F","SILOGRAB 150 EURO",2870,3164.1750000000002,"11250898F"]
["11250908F","SILOGRAB 170 EURO",3584,3951.3600000000006,"11250908F"]
["11250918F","SILOGRAB 190 EURO",4099,4519.1475,"11250918F"]
["11250928F","SILOGRAB 210 EURO",4485,4944.7125000000005,"11250928F"]
["11250938F","SILOGRAB 230 TYP 8 EURO",4872,5371.380000000001,"11250938F"]
["11250948F","SILOGRAB 250 TYP 8 EURO",5299,5842.1475,"11250948F"]
["11251018F","53\" BUCKET 135H EURO",898,990.04500000000019,"11251018F"]
["11251028F","63\" BUCKET 160H EURO",1095,1207.2375,"11251028F"]
["11251038F","73\" BUCKET 185H  EURO",1258,1386.9450000000002,"11251038F"]
["11251048F","83\" BUCKET 210H  EURO",1413,1557.8325000000002,"11251048F"]
["11251058F","95\" BUCKET 240H EURO",1908,2103.5700000000002,"11251058F"]
["11251068F","73\" BUCKET 185 HD EURO",1487,1639.4175000000002,"11251068F"]
["11251078F","83\" BUCKET 210 HD EURO",1689,1862.1225000000002,"11251078F"]
["11251087F","BUCKET 240 HD EURO - Q98",2490,2745.2249999999999,"11251087F"]
["11251088F","95\" BUCKET 240 HD EURO",2339,2578.7475000000004,"11251088F"]
["11251097F","BUCKET 260 HD EURO - Q98",2962,3265.605,"11251097F"]
["11251098F","102\" BUCKET 260 HD EURO",2830,3120.0750000000003,"11251098F"]
["11251108F","53\"BUCKET 135 HT EURO",1177,1297.6425000000002,"11251108F"]
["11251118F","63\" BUCKET 160 HT EURO",1416,1561.14,"11251118F"]
["11251128F","73\" BUCKET 185 HT EURO",1564,1724.3100000000002,"11251128F"]
["11251138F","83\" BUCKET 210 HT EURO",1796,1980.0900000000004,"11251138F"]
["11251148F","79\" BUCKET 200 HV EURO",1592,1755.1800000000003,"11251148F"]
["11251158F","87\" BUCKET 220 HV EURO",1989,2192.8725000000004,"11251158F"]
["11251368F","HINGED BALE FORK 140 - 2 TINES",1792,1975.6800000000003,"11251368F"]
["11251378F","HINGED BALE FORK 190 - 5 TINES",2643,2913.9075000000003,"11251378F"]
["11251438F","3-POINT LINKAGE ALO ATTACHMENT",848,934.92000000000019,"11251438F"]
["11251528F","H-D GRADING BUCKET 85\" 23CU.FT",1671,1842.2775000000004,"11251528F"]
["11251548F","STONE FORK 150 TYPE 8(EURO)",2312,2548.98,"11251548F"]
["11251558F","STONE FORK 200 TYPE 8(EURO)",2925,3224.8125,"11251558F"]
["11251588F","73\" BUCKET 185S  EURO",1266,1395.7650000000001,"11251588F"]
["11251598F","83\" BUCKET 210S  EURO",1413,1557.8325000000002,"11251598F"]
["11251661F","BALLASTING BOX, 3-PT,HITCH 2/3",1050,1157.625,"11251661F"]
["11251694F","BALE SPIKE SSL",703,604,"11251694F"]
["11251698F","BALE SPIKE EURO",703,604,"11251698F"]
["11251720F","BIG BALE FORK SSL",731,700,"11251720F"]
["11251721F","73\" BUCKET 185S SKID STEER",1266,1395.7650000000001,"11251721F"]
["11251728F","BIG BALE FORK EURO",731,700,"11251728F"]
["11251730F","48\" Pin On  ",587,647.16750000000002,"11251730F"]
["11251740F","54\" Pin On ",652,718.83,"11251740F"]
["11251760F","66\" Pin On ",707,779.46750000000009,"11251760F"]
["11251808F","83\" BUCKET 210 HDV EURO",2287,2521.4175,"11251808F"]
["11251818F","95\" BUCKET 240 HDV EURO",2681,2955.8025000000002,"11251818F"]
["11251821F","83\" BUCKET 210S  SKIDSTEER",1413,1557.8325000000002,"11251821F"]
["11251827F","BUCKET 260 HDV EURO - Q98",3438,3790.3950000000004,"11251827F"]
["11251828F","102\" BUCKET 260 HDV EURO",3328,3669.1200000000003,"11251828F"]
["11251838F","MANURE FORK 130 EURO",917,1010.9925000000001,"11251838F"]
["11251848F","MANURE FORK 150 EURO",1041,1147.7025000000001,"11251848F"]
["11251858F","MANURE FORK 170 EURO",1270,1400.175,"11251858F"]
["11251868F","MANURE FORK 190 EURO",1555,1714.3875,"11251868F"]
["11251878F","MANURE FORK 230 EURO",1647,{"$f":"C1155*1.05*1.05","v":1815.8175000000001},"11251878F"]
["11251921F","66\" Skid Steer (160-180C)",760,837.90000000000009,"11251921F"]
["11251931F","72\" Skid Steer (160-180C)",849,936.02250000000004,"11251931F"]
["11251938F","72\" Euro (160-180C)",849,936.02250000000004,"11251938F"]
["11251941F","73\" BUCKET 185U SSL",899,991.14750000000004,"11251941F"]
["11251948F","73\" BUCKET 185U EURO",899,991.14750000000004,"11251948F"]
["11251951F","83\" BUCKET 210U SSL",986,1087.0650000000001,"11251951F"]
["11251958F","83\" BUCKET 210U EURO",986,1087.0650000000001,"11251958F"]
["11251970F","60\" Skid Steer (160-180C)",707,779.46750000000009,"11251970F"]
["11252008F","FLEXIGRIP 160",2825,3114.5625,"11252008F"]
["11252011F","Log Grab New",1903,2098.0575000000003,"11252011F"]
["11252018F","FLEXIGRIP 200",3064,3378.0600000000004,"11252018F"]
["11252050F","HYD. PALLET ADD ON KIT",1217,1341.7425000000003,"11252050F"]
["11252111F","160MPU SKID STEER",2679,2953.5975000000003,"11252111F"]
["11252118F","160 MPU EURO",2679,2953.5975000000003,"11252118F"]
["11252121F","180MPU SKID STEER",2814,3102.4350000000004,"11252121F"]
["11252128F","180 MPU EURO",2814,3102.4350000000004,"11252128F"]
["11252131F","210MPU SKID STEER",2947,3249.0675000000001,"11252131F"]
["11252138F","210 MPU EURO",2947,3249.0675000000001,"11252138F"]
["11252141F","160MP SKID STEER",3567,3932.6175000000007,"11252141F"]
["11252148F","160MP EURO",3567,3932.6175000000007,"11252148F"]
["11252151F","185MP SKID STEER",3754,4138.7850000000008,"11252151F"]
["11252158F","185MP EURO",3754,4138.7850000000008,"11252158F"]
["11252161F","210MP SKID STEER",4416,4868.6400000000003,"11252161F"]
["11252168F","210MP EURO",4416,4868.6400000000003,"11252168F"]
["11252301F","38\" 1000KG PALLET FORK (SSL)",954,1051.7850000000001,"11252301F"]
["11252311F","PALLET FORK 1000/1220",963,899,"11252311F"]
["11252331F","PALLET FORK 1600/1220",1061,949,"11252331F"]
["11252341F","PALLET FORK 2500/1220",1245,1090,"11252341F"]
["11252441F","160MPT SKID STEER",3798,4187.2950000000001,"11252441F"]
["11252448F","160MPT EURO",3798,4187.2950000000001,"11252448F"]
["11252451F","185MPT  SKID STEER",4021,4433.1525000000001,"11252451F"]
["11252458F","185MPT EURO",4021,4433.1525000000001,"11252458F"]
["11252461F","210MPT SKID STEER",4715,5198.2875000000004,"11252461F"]
["11252468F","210MPT EURO",4715,5198.2875000000004,"11252468F"]
["11252650F","200XH WITHOUT HOOKS",4689,5169.6225000000004,"11252650F"]
["11252658F","200XH EURO",4769,5257.8225000000002,"11252658F"]
["11252660F","220XH WITHOUT HOOKS",4876,5375.7900000000009,"11252660F"]
["11252668F","220XH EURO",4956,5463.9900000000007,"11252668F"]
["11252670F","240XH WITHOUT HOOKS",5063,5581.9575000000004,"11252670F"]
["11252678F","240XH EURO",5144,5671.26,"11252678F"]
["11252680F","260XH WITHOUT HOOKS",5251,5789.2275000000009,"11252680F"]
["11252688F","260XH EURO",5332,5878.5300000000007,"11252688F"]
["11252718F","PALLET FORK 1000/1221",963,899,"11252718F"]
["11252738F","PALLET FORK 1600/1221",1061,949,"11252738F"]
["11252748F","PALLET FORK 2500/1221",1245,1090,"11252748F"]
["11252848F","Snow Clearing Bucket SC PRO",7302,8050.4550000000008,"11252848F"]
["11252918F"," SILOCUT 125SG",6497,7162.942500000001,"11252918F"]
["11252928F","SILOCUT 150 SE EURO(8)",6973,7687.732500000001,"11252928F"]
["11252928F"," SILOCUT 150SG",6973,7687.732500000001,"11252928F"]
["11252948F","SILOCUT 200SG",8648,9534.42,"11252948F"]
["11252958F"," SILOCUT 225SG",8969,9888.322500000002,"11252958F"]
["11260117F","MAXI GRAPPLE 210 - BUCKET ONLY",2468,2720.9700000000003,"11260117F"]
["11260118F","MAXI GRAPPLE 210T - BUCKET ONLY ",2568,2831.2200000000003,"11260118F"]
["11260119F","MAXI GRAPPLE 240 - BUCKET ONLY",3007,3315.2175000000002,"11260119F"]
["11260120F","MAXI GRAPPLE 240T - BUCKET ONLY",3129,3449.7225000000003,"11260120F"]
["11260121F","MAXI GRAPPLE 260 - BUCKET ONLY",3300,3638.25,"11260121F"]
["11260122F","MAXI GRAPPLE 260T - BUCKET ONLY",3435,3787.0875000000001,"11260122F"]
["11260141-1","WELD-ON UPPER GRAPPLE SUPPORTS",350,385.875,"11260141-1"]
["11260348F","SQUARE BALE FORK,EXTENSION SET",277,305.39250000000004,"11260348F"]
["11260349F","BIG BALE LIFTER, EXTENSION",277,305.39250000000004,"11260349F"]
["11260828F","SIDE PLATE EXTENSION - MULTIBENNE",173,190.73250000000002,"11260828F"]
["11260914F","BACK SCREEN H-D BUCKET,GRAPPLE",337,371.54250000000002,"11260914F"]
["11261620F","BACK SCREEN KIT UTILITY GRAPPL",285,314.21250000000003,"11261620F"]
["11262087F","MAXI GRAPPLE 260T WITH TINES - Q98",6928,{"$f":"C1219*1.05*1.05","v":7638.1200000000008},"11262087F"]
["11292938F"," SILOCUT 175SG",7486,8253.3150000000005,"11292938F"]
["15004BAA","ERGODRIVE LCS FENDT 400-SERIES",1494,1647.1350000000002,"15004BAA"]
["15004FCA","ELECTRODRIVE LCS FENDT 400-900",3451,3804.7275000000004,"15004ECA"]
["15005BAA","ERGODRIVE LCS JD",1494,1647.1350000000002,"15005BAA"]
["15005DAA","ERGODRIVE LCS L3 JD",2482,2736.4050000000002,"15005DAA"]
["15005ECA","ELECTRODRIVE LCS JD",3451,3804.7275000000004,"15005ECA"]
["15005FCA","ELECTRODRIVE LCS JD 6230, 6330,6430,7130",3451,3804.7275000000004,"15005FCA"]
["15005FCA","ELECTRODR LCS PRO JD",3451,3804.7275000000004,"15005FCA"]
["15005GCA","ELECTRODRIVE LCS L3 JD 6032",4437,4891.7925000000005,"15005GCA"]
["15006BAA","ERGODRIVE LCS JD 6020",1494,1647.1350000000002,"15006BAA"]
["15006ECA","ELECTRODRIVE LCS JD 6020",3451,3804.7275000000004,"15006ECA"]
["15006FCA","ELECTRODR LCS PRO JD 6020",3451,3804.7275000000004,"15006FCA"]
["15007BAA","ERGODRIVE LCS JD 6020",1494,1647.1350000000002,"15007BAA"]
["15007DAA","ERGODRIVE LCS LIVE3 JD 6020",2482,2736.4050000000002,"15007DAA"]
["15007FCA","ELECTRODRIVE LCS JD 6020",3451,3804.7275000000004,"15007ECA"]
["15007GCA","ELECTRODRIVE LCS LIVE3 JD 6020",4437,4891.7925000000005,"15007GCA"]
["15010BAA","ERGODRIVE LCS DEUTZ AGROTRON M",1494,1647.1350000000002,"15010BAA"]
["15010FCA","ELECTRODRIVE DEUTZ AGROTRON M M",3451,3804.7275000000004,"15010FCA"]
["15012BAB","ERGODRIVE LCS  CNH T6000",1494,1647.1350000000002,"15012BAB"]
["15013BFA","ERGODRIVE LCS  AGCO",1494,1647.1350000000002,"15013BFA"]
["15014BFA","ERGODRIVE LCS  AGCO",1494,1647.1350000000002,"15014BFA"]
["15013FCA","ELECTRODRIVE LCS  AGCO",3451,3804.7275000000004,"15013FCA"]
["15014FCA","ELECTRODR LCS PRO AGCO",3451,3804.7275000000004,"15014FCA"]
["15015FCA","ELECTRODR LCS PRO AGCO",3451,3804.7275000000004,"15015FCA"]
["15014GCA","ELECTRODRIVE LCSO LIVE3  AGCO",4437,4891.7925000000005,"15014GCA"]
["15016BAB","ERGODRIVE LCS  CNH T6000",1494,1647.1350000000002,"15016BAB"]
["15018BAB","ERGODRIVE LCS  CNH T6000",1494,1647.1350000000002,"15018BAB"]
["15019BAA","NH T5000 HYD SET 2 FCN MECH",1494,1647.1350000000002,"15019BAA"]
["15019FCA","ELECTRODRIVE LCS CNH T5000",3451,3804.7275000000004,"15019ECA"]
["15020BAA","ERGODRIVE LCS MF 6400-7400",1494,1647.1350000000002,"15020BAA"]
["15020DAA","ERGODRIVE LCS LIVE3 MF 6400-74",2482,2736.4050000000002,"15020DAA"]
["15021FCA","ELECTRODRIVE LCS ",3451,3804.7275000000004,"15021FCA"]
["15022BAA","ERGODRIVE LCS",1494,1647.1350000000002,"15022BAA"]
["15023BAA","ERGODRIVE LCS CNH T4000",1494,1647.1350000000002,"15023BAA"]
["15024BAA","ERGODRIVE NH TD5000",1494,1647.1350000000002,"15024BAA"]
["15025BAA","ERGODRIVE LCS CNH TD5000/JX",1494,1647.1350000000002,"15025BAA"]
["15027BAA","ERGODRIVE LCS VALTRA 6 & 8000",1494,1647.1350000000002,"15027BAA"]
["15027FCA","ELECTRODRIVE LCS VALTRA 6000",3451,3804.7275000000004,"15027FCA"]
["15028BAA","ERGODRIVE LCS VALTRA T",1494,1647.1350000000002,"15028BAA"]
["15028FCA","ELECTRODRIVE LCS VALTRA T",3451,3804.7275000000004,"15028FCA"]
["15031BAA","ERGODRIVE LCS VALTRA A-SER",1494,1647.1350000000002,"15031BAA"]
["15031FCA","ELECTRODRIVE LCS VALTRA A-SER",3451,3804.7275000000004,"15031FCA"]
["15032BAA","ERGODRIVE LCS DEUTZ AGROTRON K",1494,1647.1350000000002,"15032BAA"]
["15032DAA","ERGODRIVE LCS DEUTZ AGROTRON K",2482,2736.4050000000002,"15032DAA"]
["15032FCA","ELECTRODRIVE DEUTZAGROTRON K",3451,3804.7275000000004,"15032FCA"]
["15032GCA","ELECTRODRIVE DEUTZAGROTRON K",4437,4891.7925000000005,"15032GCA"]
["15034BAA","ERGODRIVE LCS VALTRA",1494,1647.1350000000002,"15034BAA"]
["15034FCA","ELECTRODRIVE LCS VALTRA",3451,3804.7275000000004,"15034FCA"]
["15038BAA","ERGODRIVE LCS ZETOR PROXIMA",1494,1647.1350000000002,"15038BAA"]
["15039BAA","ERGODRIVE LCS  NH T6000",1494,1647.1350000000002,"15039BAA"]
["15039DAA","ERGODRIVE LCS LIVE3  NH T6000",2482,2736.4050000000002,"15039DAA"]
["15039ECA","ELECTRODRIVE LCS  NH T6000",3451,3804.7275000000004,"15039ECA"]
["15039FCA","ELECTRODRIVE CIH MXU 100-135 LTD",3451,3804.7275000000004,"15039FCA"]
["15039FCA","ELECTRODR LCS PRO NH T6000",3451,3804.7275000000004,"15039FCA"]
["15039GCA","ELECTRODRIVE LCS L3  NH T6000",4437,4891.7925000000005,"15039GCA"]
["15040BAA","ERGODRIVE LCS MCCORM CX",1494,1647.1350000000002,"15040BAA"]
["15040FCA","ELECTRODRIVE LCS MCCORM CX",1494,1647.1350000000002,"15040FCA"]
["15041BAA","ERGODRIVE LCS MCC/LANDINI",1494,1647.1350000000002,"15041BAA"]
["15041DAA","ERGODRIVE LCS LIVE3 MCC/LANDIN",2482,2736.4050000000002,"15041DAA"]
["15041ECA","ELECTRODRIVE LCS MCC/LANDINI",3451,3804.7275000000004,"15041ECA"]
["15041GCA","ELECTRODRIVE LCS L3 McC XTX",4437,4891.7925000000005,"15041GCA"]
["15042BAA","ERGODRIVE LCS LANDINI",1494,1647.1350000000002,"15042BAA"]
["15043BAA","ERGODRIVE LCS MCCORM MC",1494,1647.1350000000002,"15043BAA"]
["15043DAA","ERGODRIVE LCS LIVE3 MCCORM MC       ",2482,{"$f":"C1283*1.05*1.05","v":2736.4050000000002},"15043DAA"]
["15043FCA","ELECTRODRIVE LCS MCCORM MC",3451,3804.7275000000004,"15043FCA"]
["15043GCA","ELDRIVE LCS L3  McC MTX165,185",4437,4891.7925000000005,"15043GCA"]
["15044BAA","ERGODRIVE LCS MCCORM MC",1494,1647.1350000000002,"15044BAA"]
["15044DAA","ERGODRIVE LCS LIVE3 MCCORM MC",2482,2736.4050000000002,"15044DAA"]
["15044ECA","ELECTRODRIVE LCS MCCORM MC",3451,3804.7275000000004,"15044ECA"]
["15044FCA","ELCS Electric CNH",3451,3804.7275000000004,"15044FCA"]
["15044GCA","ELECTRODRIVE LCS L3 MCCORM MC",4437,4891.7925000000005,"15044GCA"]
["15045BAA","ERGODRIVE LCS CNH T7000",1494,1647.1350000000002,"15045BAA"]
["15045ECA","ELECTRODRIVE LCS CNH T7000",3451,3804.7275000000004,"15045ECA"]
["15045FCA","2 Funtion Electric Valve",3451,3804.7275000000004,"15045FCA"]
["15045GCA","ELDRIVE LCS L3 CNH T7000/PUMA",4437,4891.7925000000005,"15045GCA"]
["15046BAA","ERGODRIVE LCS CNH T6000",1494,1647.1350000000002,"15046BAA"]
["15046ECA","ELECTRODRIVE LCS CNH T6000",3451,3804.7275000000004,"15046ECA"]
["15046GCA","ELECTRODRIVE LCS L3  NH T6000",4437,4891.7925000000005,"15046GCA"]
["15048BAA","ERGODRIVE LCS CNH TL/JXU",1494,1647.1350000000002,"15048BAA"]
["15050BAA","ERGODRIVE LCS LAND/MCC",1494,1647.1350000000002,"15050BAA"]
["15051BAA","ERGODRIVE LCS NH TC90-115",1494,1647.1350000000002,"15051BAA"]
["15052BAA","ERGODRIVE LCS CNH TM/MXM",1494,1647.1350000000002,"15052BAA"]
["15052DAA","ERGODRIVE LCS LIVE3 CNH TM/MXM",2482,2736.4050000000002,"15052DAA"]
["15052ECA","ELECTRODRIVE LCS CNH TM/MXM",3451,3804.7275000000004,"15052ECA"]
["15052FCA","ELECTRODRIVE CIH MXM 120-190 PRO",3451,3804.7275000000004,"15052FCA"]
["15052FCA","ELECTRODR LCS PRO TM - MXM",3451,3804.7275000000004,"15052FCA"]
["15052GCA","ELECTRODRIVE LCS CNH TM/MXM",4437,4891.7925000000005,"15052GCA"]
["15053BAA","ERGODRIVE LCS CNH TN/JXC",1494,1647.1350000000002,"15053BAA"]
["15054BAC","ERGODRIVE LCS MAXXUM",1494,1647.1350000000002,"15054BAC"]
["15054DAC","HYDRAULIC SET LCS CASE 5120",2482,2736.4050000000002,"15054DAC"]
["15056BAA","ERGODRIVE LCS LANDINI",1494,1647.1350000000002,"15056BAA"]
["15062BAA","ERGODRIVE LCS FENDT 209P T2",1494,1647.1350000000002,"15062BAA"]
["15063BAA","ERGODRIVE LCS MCCORMICK MC",1494,1647.1350000000002,"15063BAA"]
["15063BAC","ERGODRIVE LCS CNH MX",1494,1647.1350000000002,"15063BAC"]
["15064BAA","ERGODRIVE LCS LAND VISION",1494,1647.1350000000002,"15064BAA"]
["15066BAA","ERGODRIVE LCS LAND/MCCORM",1494,1647.1350000000002,"15066BAA"]
["15068BAA","ERGODRIVE LCS LAND/MCCORM",1494,1647.1350000000002,"15068BAA"]
["15069BAC","ERGODRIVE LCS LAND MYTHOS",1494,1647.1350000000002,"15069BAC"]
["15071BAA","ERGODRIVE LCS LANDINI LEGEND",1494,1647.1350000000002,"15071BAA"]
["15072BAA","ERGODRIVE LCS LANDINI LANDPOW",1494,1647.1350000000002,"15072BAA"]
["15075BAA","ERGODRIVE LCS CNH T7000/PUMA",1494,1647.1350000000002,"15075BAA"]
["15076BAA","ERGODRIVE LCS CASE JX1075-1095N",1494,1647.1350000000002,"15076BAA"]
["15079BAA","ERGODRIVE LCS CASE MAGNUM",1494,1647.1350000000002,"15079BAA"]
["15079DAA","ERGODRIVE LCS LIVE 3 CASE MAGN",2482,2736.4050000000002,"15079DAA"]
["15079FCA","ELECTRODRIVE LCS CASE MAGNUM",3451,3804.7275000000004,"15079FCA"]
["15079GCA","ELECTRODRIVE LCS LIVE3 CNH",4437,4891.7925000000005,"15079GCA"]
["15081BAA","ERGODRIVE LCS JD 7730-7930",1494,1647.1350000000002,"15081BAA"]
["15081DAA","HYDRAULIC SET LCS JD",2482,2736.4050000000002,"15081DAA"]
["15081FCA","ELECTRODRIVE LCS JD 7730-7930",3451,3804.7275000000004,"15081FCA"]
["15082BAA","ERGODRIVE LCS JD 5025",1494,1647.1350000000002,"15082BAA"]
["15084BAA","ERGODRIVE LCS NH TNF,TNFA",1494,1647.1350000000002,"15084BAA"]
["15086BAA","ERGODRIVE LCS CNH TNN,TNNA,JXC",1494,1647.1350000000002,"15086BAA"]
["15087BAA","ERGODRIVE LCS NH M/60-SER",1494,1647.1350000000002,"15087BAA"]
["15089BAA","ERGODRIVE LCS NH TM",1494,1647.1350000000002,"15089BAA"]
["15090BAA","ERGODRIVE LCS CNH TG/MX MAGNUM",1494,1647.1350000000002,"15090BAA"]
["15090DAA","ERGODRIVE LCS LIVE3 CNH TG/MX",2482,2736.4050000000002,"15090DAA"]
["15090ECA","ELECTRODRIVE LCS CNH TG/MX MAG",3451,3804.7275000000004,"15090ECA"]
["15090FCA","ELECTRODRIVE  CIH MX180-245",3451,3804.7275000000004,"15090FCA"]
["15090FCA","ELECTRODR LCS PRO CNH TG-MX",3451,3804.7275000000004,"15090FCA"]
["15090GCA","ELECTRODRIVE LCS LIVE3 CNH",4437,4891.7925000000005,"15090GCA"]
["15091BAA","ERGODRIVE LCS NH/BUHLER G/70",1494,1647.1350000000002,"15091BAA"]
["15091DAA","ERGODRIVE LCS  LIVE3 NH/BUHLER",2482,2736.4050000000002,"15091DAA"]
["15091FCA","ELECTRODRIVE LCS NH/BUHLER G/7",3451,3804.7275000000004,"15091FCA"]
["15091GCA","ELECTRODRIVE LCS LIVE3 NH G/70",4437,4891.7925000000005,"15091GCA"]
["15093BAA","HYDRAULIC SET NH TB 100-120",1494,1647.1350000000002,"15093BAA"]
["15094BAA","ERGODRIVE LCS MF 3615-3645",1494,1647.1350000000002,"15094BAA"]
["15096BAA","ERGODRIVE LCS MF 4325-4370",1494,1647.1350000000002,"15096BAA"]
["15097BFA","ERGODRIVE LCS MF 5400-SER",1494,{"$f":"C1347*1.05*1.05","v":1647.1350000000002},"15097BFA"]
["15097ECA","ELECTRODRIVE LCS MF 5400 SER",3451,3804.7275000000004,"15097ECA"]
["15098BAA","ERGODRIVE LCS MF 573-596",1494,1647.1350000000002,"15098BAA"]
["15100BFA","ERGODRIVE LCS  MASSEY 6465-80",1494,1647.1350000000002,"15100BFA"]
["15102BAA","ERGODRIVE LCSMF 471-492 CAB",1494,1647.1350000000002,"15102BAA"]
["15106BAA","ERGODRIVE LCS MF 6110-6190",1494,1647.1350000000002,"15106BAA"]
["15107BAA","ERGODRIVE LCS MF 533,543,563",1494,1647.1350000000002,"15107BAA"]
["15108BAA","ERGODRIVE LCS MF 6260-6290",1494,1647.1350000000002,"15108BAA"]
["15108ECA","ELECTRODRIVE LCS MF 6260-6290",3451,3804.7275000000004,"15108ECA"]
["15110BAA","ERGODRIVE LCS MF 8450-80/AGCO",1494,1647.1350000000002,"15110BAA"]
["15110DAA","ERGODRIVE LCS LIVE3 MF 8450-80",2482,2736.4050000000002,"15110DAA"]
["15112BAA","ERGODRIVE LCS MF 6497-6499",1494,1647.1350000000002,"15112BAA"]
["15113BAA","ERGODRIVE LCS MF 251XE",1494,1647.1350000000002,"15113BAA"]
["15114BAA","ERGODRIVE LCS MF 451-492  ROPS",1494,1647.1350000000002,"15114BAA"]
["15115BAA","ERGODRIVE LCS MF 8210-8250",1494,1647.1350000000002,"15115BAA"]
["15118BAA","ERGODRIVE LCS VALTRA T&M SERIE",1494,1647.1350000000002,"15118BAA"]
["15118FCA","ELECTRODRIVE LCS VALTRA T&M SE",3451,3804.7275000000004,"15118FCA"]
["15124BEA","ERGODRIVE LCS KUBOTA M85,9540",1494,1647.1350000000002,"15124BEA"]
["15125BAA","ERGODRIVE LCS KUBOTA M110,M125",1494,1647.1350000000002,"15125BAA"]
["15126BAA","ERGODRIVE LCS KUBOTA M4900",1494,1647.1350000000002,"15126BAA"]
["15129BAA","ERGODRIVE LCS KUBOTA M8200",1494,1647.1350000000002,"15129BAA"]
["15130BAA","ERGODRIVE LCS KUBOTA M95S-105S",1494,1647.1350000000002,"15130BAA"]
["15132BAA","ERGODRIVE LCS KUBOTA M4900",1494,1647.1350000000002,"15132BAA"]
["15133BAA","ERGODRIVE LCS KUBOTA M110,M120",1494,1647.1350000000002,"15133BAA"]
["15137BAA","ERGODRIVE LCS JD 7200-7810",1494,1647.1350000000002,"15137BAA"]
["15137BAC","ERGODRIVE LCS JD 7200-7810",1494,1647.1350000000002,"15137BAC"]
["15137DAC","ERGODRIVE LCS L3 JD7200-7810",2482,2736.4050000000002,"15137DAC"]
["15137DCC","JD 7600-7810 HYD SET 3 FCN MECH",2482,2736.4050000000002,"15137DCC"]
["15137ECC","JD 7600-7810 HYD SET 2 FCN ELEC",3451,3804.7275000000004,"15137ECC"]
["15137FCA","ELECTRODRIVE JD 7600-7810",3451,3804.7275000000004,"15137FCA"]
["15137FCC","ELECTRODR LCS JD 7200-7810",3451,3804.7275000000004,"15137FCC"]
["15137GCC","JD 7600-7810 HYD SET 3 FCN ELEC",4437,4891.7925000000005,"15137GCC"]
["15138BAA","ERGODRIVE LCS JD 6003-SER",1494,1647.1350000000002,"15138BAA"]
["15139BAA","ERGODRIVE LCS JD 5003-SER",1494,1647.1350000000002,"15139BAA"]
["15141BAA","ERGODRIVE LCS JD 6000D",1494,1647.1350000000002,"15141BAA"]
["15154BAA","ERGODRIVE LCS DEUTZ AGROFARM",1494,1647.1350000000002,"15154BAA"]
["15154ECA","ELECTRODRIVE DEUTZ AGROFARM",3451,3804.7275000000004,"15154ECA"]
["15154FCA","ELECTRODRIVE LCS AGROFARM",3451,3804.7275000000004,"15154FCA"]
["15155BAA","ERGODRIVE LCS DEUTZ AGROPLUS",1494,1647.1350000000002,"15155BAA"]
["15165BAA","ERGODRIVE DEUTZ/SAME/LAMB",1494,1647.1350000000002,"15165BAA"]
["15169BAA","ERGODRIVE LCS SAME SILVER",1494,1647.1350000000002,"15169BAA"]
["15170FCA","ELECTRODRIVE DEUTZ AGROTRON K PROFI",3451,3804.7275000000004,"15170FCA"]
["15172BAA","ERGODRIVE LCS VALTRA",1494,1647.1350000000002,"15172BAA"]
["15172FCA","ELECTRODRIVE LCS VALTRA T122-1",3451,3804.7275000000004,"15172FCA"]
["15174BAA","ERGODRIVE LCS MF 6260-6290",1494,1647.1350000000002,"15174BAA"]
["15177ECA","ELECTRODRIVE LCS MF8600",3451,3804.7275000000004,"15177ECA"]
["15177FCA","ELECTRODR LCS PRO MF 8600",3451,3804.7275000000004,"15177FCA"]
["15178BAA","ERGODRIVE LCS JD 5055E-5075E",1494,1647.1350000000002,"15178BAA"]
["15178DAA","ERGODRIVE LCS L3 JD 5055E-5075",2482,2736.4050000000002,"15178DAA"]
["15180BAA","ERGODRIVE LCS MF 6160-6180",1494,1647.1350000000002,"15180BAA"]
["15182FCA","ELECTRODRIVE DEUTZ AGROTRON TTV 600",3451,3804.7275000000004,"15182FCA"]
["15182GCA","ELECTRODRIVE DEUTZ AGROTRON TTV 600",4437,4891.7925000000005,"15182GCA"]
["15183BAA","LCS DEUTZ AGROLUX",1494,1647.1350000000002,"15183BAA"]
["15184BAA","ERGODRIVE LCS DEUTZ AGROPLUS",1494,1647.1350000000002,"15184BAA"]
["15188BAA","ERGODRIVE LCS KUBOTA M110-125X",1494,1647.1350000000002,"15188BAA"]
["15188DAA","ERGODRIVE LCS L3 KUBOTA M96-108S/X",2482,2736.4050000000002,"15188DAA"]
["15188FCA","ELECTRODRIVE LCS KUBOTA M110X",3451,3804.7275000000004,"15188FCA"]
["15188GCA","ELECTRODRIVE LCS L3 KUB M110X-",4437,4891.7925000000005,"15188GCA"]
["15189BAA","ERGODRIVE LCS KUBOTA M110-125X",1494,1647.1350000000002,"15189BAA"]
["15197BAC","ERGODRIVE LCS MCCORM CMAX, TMAX",1494,1647.1350000000002,"15197BAC"]
["15198BAA","ERGODRIVE LCS LAND/ MCCORM",1494,1647.1350000000002,"15198BAA"]
["15199BAA","ERGODRIVE LCS LAND/ MCCORM",1494,1647.1350000000002,"15199BAA"]
["15201BAA","ERGODRIVE LCS JD 8100-8400",1494,1647.1350000000002,"15201BAA"]
["15201DAA","ERGODRIVE LCS LIVE3 JD 81-8400",2482,2736.4050000000002,"15201DAA"]
["15201FCA","ELECTRODRIVE LCS JD 8100-8400",3451,{"$f":"C1411*1.05*1.05","v":3804.7275000000004},"15201FCA"]
["15201GCA","ELECTRODRIVE JD 8000",4437,4891.7925000000005,"15201GCA"]
["15203BEA","ERGODRIVE LCS KUBOTA M SERIES",1494,1647.1350000000002,"15203BEA"]
["15203FCA","ELECTRODRIVE LCS KUBOTA NA",3451,3804.7275000000004,"15203FCA"]
["15212BAA","ERGODRIVE LCS MF 342-399",1494,1647.1350000000002,"15212BAA"]
["15221BAA","ERGODRIVE LCS ZETOR",1494,1647.1350000000002,"15221BAA"]
["15228BAA","ERGODRIVE LCS JD 5M NA",1494,1647.1350000000002,"15228BAA"]
["15231BAA","ERGODRIVE LCS FORD",1494,1647.1350000000002,"15231BAA"]
["15232BAA","ERGODRIVE LCS FORD",1494,1647.1350000000002,"15232BAA"]
["15238BAA","ERGODRIVE LCS FORD 6710,7710",1494,1647.1350000000002,"15238BAA"]
["15242BAA","ERGODRIVE LCS NH 5610-7610, 7810",1494,1647.1350000000002,"15242BAA"]
["15243BAA","ERGODRIVE LCS FORD 5110-7610",1494,1647.1350000000002,"15243BAA"]
["15250DAA","ERGODRIVE LCS LIVE 3 MCCORM MTX",2482,2736.4050000000002,"15250DAA"]
["15253BAA","ERGODRIVE LCS LANDINI REX/MCCO",1494,1647.1350000000002,"15253BAA"]
["15254FCC","ELECTRODRIVE DEUTZ AGROTRON TTV 630",3451,3804.7275000000004,"15254FCC"]
["15254GCC","ELECTRODRIVE DEUTZ AGROTRON TTV 630",4437,4891.7925000000005,"15254GCC"]
["15256BAA","ERGODRIVE LCS DEUTZ AGROFARM",1494,1647.1350000000002,"15256BAA"]
["15256DAA","ERGODRIVE LCS DEUTZ AGROFARM",2482,2736.4050000000002,"15256DAA"]
["15256FCA","ELECTRODRIVE DEUTZ AGROFARM PROFI",3451,3804.7275000000004,"15256FCA"]
["15256GCA","ELECTRODRIVE DEUTZ AGROFARM PROFI",4437,4891.7925000000005,"15256GCA"]
["15257ECA","ELECTRODRIVE LCS CNH T8/MAGNUM",3451,3804.7275000000004,"15257ECA"]
["15257FCA","ELECTRODRIVE LCS CNH T8/MAGNUM",3451,3804.7275000000004,"15257FCA"]
["15257FCA","ELECTRODR LCS CNH T8 - MAGNUM",3451,3804.7275000000004,"15257FCA"]
["15257GCA","ELECTRODRIVE LCS CNH T8/MAG.T4",4437,4891.7925000000005,"15257GCA"]
["15258FCA","ELECTRODRIVE LCS JD 8R",3451,3804.7275000000004,"15258FCA"]
["15258GCA","ELECTRODRIVE JD 8000R",4437,4891.7925000000005,"15258GCA"]
["15259BAA","ERGODRIVE KUBOTA LCS M8540N",1494,1647.1350000000002,"15259BAA"]
["15265BAA","2 FCTN VALVE KIT NH TS6000",1494,1647.1350000000002,"15265BAA"]
["15267BAA","ERGODRIVE LCS NH",1494,1647.1350000000002,"15267BAA"]
["15270BAC","ERGODRIVE LCS DEUTZ 6150,60",1494,1647.1350000000002,"15270BAC"]
["15270ECC","ELECTRODRIVE DEUTZ AGROTRON TTV 400",3451,3804.7275000000004,"15270ECC"]
["15270FCC","ELECTRODRIVE LCS DEUTZ AG 6150",3451,3804.7275000000004,"15270FCC"]
["15270GCC","ELECTRODRIVE DEUTZ AGROTRON TTV 400",4437,4891.7925000000005,"15270GCC"]
["15271ECA","ELECTRODRIVE LCS",3451,3804.7275000000004,"15271ECA"]
["15271FCA","ELECTRODRIVE MCCORMICK X60",3451,3804.7275000000004,"15271FCA"]
["15271FCA","ELECTRODR LCS MCCORMICK X60",3451,3804.7275000000004,"15271FCA"]
["15272BAA","ERGODRIVE LCS",1494,1647.1350000000002,"15272BAA"]
["15272DAC","ERGODRIVE  LCS L3",2482,2736.4050000000002,"15272DAC"]
["15272DAC","ERGODRIVE  LCS L3",2482,2736.4050000000002,"15272DAC"]
["15287BAA","ERGODRIVE LCS CNH T4/ FARMALL",1494,1647.1350000000002,"15287BAA"]
["15292ECA","ELECTRODRIVE LCS JD 7R",3451,3804.7275000000004,"15292ECA"]
["15292FCA","ELECTRODRIVE LCS JD 7000R",3451,3804.7275000000004,"15292FCA"]
["15292FCA","ELECTRODR LCS JD 7200R",3451,3804.7275000000004,"15292FCA"]
["15292GCA","ELECTRODRIVE LCS JD 7R",4437,4891.7925000000005,"15292GCA"]
["15297BAA","ERGODRIVE LCS KUBOTA M100GX",1494,1647.1350000000002,"15297BAA"]
["15297DAA","E.DRIVE LCS L-3 KUBOTA M100GX",2482,2736.4050000000002,"15297DAA"]
["15297FCA","ELECTRODRIVE LCS KUBOTA M100GX",3451,3804.7275000000004,"15297FCA"]
["15297GCA","EL.DRIVE LCS KUBOTA M100GX",4437,4891.7925000000005,"15297GCA"]
["15301BEA","ERGODR. LCS KUBOTA M8560-9960",1494,1647.1350000000002,"15301BEA"]
["15301DEA","E.DRIVE LCS L-3 KUBOTA M85-9960",2482,2736.4050000000002,"15301DEA"]
["15301FCA","EL.DRIVE LCS KUBOTA M8560-9960",3451,3804.7275000000004,"15301FCA"]
["15301GCA","ELECTRODRIVE L3 KUBOTA",4437,4891.7925000000005,"15301GCA"]
["15302BAB","ERGODRIVE LCS MAXXUM 115 - 125 EP",1494,1647.1350000000002,"15302BAB"]
["15304BAA","ERGODRIVE LCS JD 6140-6150R",1494,1647.1350000000002,"15304BAA"]
["15304DAA","E.DRIVE LCS L-3 JD 6140-6150R",2482,2736.4050000000002,"15304DAA"]
["15304ECA","JD 6R HYD SET 2 FCN ELEC",3451,3804.7275000000004,"15304ECA"]
["15304FCA","ELECTRODR LCS JD 6105R",3451,3804.7275000000004,"15304FCA"]
["15304GCA","EL.DRIVE LCS JD 6140-6150R",4437,4891.7925000000005,"15304GCA"]
["15308BAA","ERGODRIVE NH T5.",1494,1647.1350000000002,"15308BAA"]
["15311BAA","ERGODRIVE LCS MCCORMICK/LANDINI",1494,1647.1350000000002,"15311BAA"]
["15311DAA","ERGODRIVE LCS LIVE3 MCC/LANDIN",2482,2736.4050000000002,"15311DAA"]
["15311ECA","ELECTRODRIVE LCS MCCORMICK",3451,3804.7275000000004,"15311ECA"]
["15311FCA","ELECTRODR LCS MCCORMICK XTX",3451,3804.7275000000004,"15311FCA"]
["15311GCA","ELECTRODRIVE McC MTX, XTX",4437,4891.7925000000005,"15311GCA"]
["15315BAA","ERGODRIVE MCCORMICK X50",1494,{"$f":"C1475*1.05*1.05","v":1647.1350000000002},"15315BAA"]
["15315FCA","ELECTRODR LCS MCCORMICK ",3451,3804.7275000000004,"15315FCA"]
["15317BAA","ERGODRIVE LCS DZ 5100",1494,1647.1350000000002,"15317BAA"]
["15318BAA","ERGODR. LCS FENDT 400,700-900",1494,1647.1350000000002,"15318BAA"]
["15324BFA","ERGODRIVE LCS LS CHALLENGER",1494,1647.1350000000002,"15324BFA"]
["15324FCA","EL. DRIVE LCS LS CHALLENGER",3451,3804.7275000000004,"15324FCA"]
["15340BAA","ERGODRIVE LCS  DZ 5100 Pro",1494,1647.1350000000002,"15340BAA"]
["15342BAC","ERGODRIVE LCS  DZ 6180,90",1494,1647.1350000000002,"15342BAC"]
["15342FCC","ELECTRODRIVE LCS DEUTZ AG 6180,90",3451,3804.7275000000004,"15342FCC"]
["15345FCA","ELECTRODRIVE LCS PRO",3451,3804.7275000000004,"15345FCA"]
["15346BAA","ERGODRIVE LCS TD4/FAR. C85-105",1494,1647.1350000000002,"15346BAA"]
["15357BAC","ERGODRIVE LCS  DZ 6150.4,6160.4",1494,1647.1350000000002,"15357BAC"]
["15357FCC","ELECTRODRIVE LCS DEUTZ AG 6150.4",3451,3804.7275000000004,"15357FCC"]
["17001A","HYDR.SET KUBOTA",1220,1345.05,"17001A"]
["17002A","HYDR.SET KUBOTA",1220,1345.05,"17002A"]
["17003A","HYDR.SET MCCORM CX75-105",1220,1345.05,"17003A"]
["17004A","HYDR.SET NEW H",1220,1345.05,"17004A"]
["17005A","HYDR.SET NEW H",1220,1345.05,"17005A"]
["17006A","HYDR.SET NEW H",1220,1345.05,"17006A"]
["17007A","HYDR.SE NEW H",1220,1345.05,"17007A"]
["17008A","HYDR.SET NEW H",1220,1345.05,"17008A"]
["17009A","HYDR.SET NEW H",1220,1345.05,"17009A"]
["17010A","HYDR.SET JD",1220,1345.05,"17010A"]
["17011A","HYDR.SET MF 471-492 CAB",1220,1345.05,"17011A"]
["17012A","HYDR.SET MF 471-492 ROPS",1220,1345.05,"17012A"]
["17013A","HYDR.SET MACCORM/LANDINI",1220,1345.05,"17013A"]
["17014A","HYDR.SET MF3600",1220,1345.05,"17014A"]
["17015A","HYDR.SET DEUTZ AGROFARM 410-30",1220,1345.05,"17015A"]
["17016A","HYDR.SET SAME DORADO 3 60-90",1220,1345.05,"17016A"]
["17017A","HYDR.SET SAME EXPLORER 95",1220,1345.05,"17017A"]
["17018A","HYDR.SET DEUTZ AGROTRON 80-100",1220,1345.05,"17018A"]
["17019B","HYDR.SET MF2600-SER",1220,1345.05,"17019B"]
["17020A","HYDR.SET DEUTZ AGROLUX 310-20",1220,1345.05,"17020A"]
["17021B","HYDR.SET KUBOTA M40-SER",1220,1345.05,"17021B"]
["17023B","HYDR.SET CNH TT45A/50A",1220,1345.05,"17023B"]
["17024B","HYDR.SET CNH TT60A/75A",1220,1345.05,"17024B"]
["17025A","HYDR.SET VALTRA A-SER",1220,1345.05,"17025A"]
["17026A","HYDR.SET SAME EXPLORER 95",1220,1345.05,"17026A"]
["17027A","HYDR.SET DEUTZ AGROTR K410-430",1220,1345.05,"17027A"]
["17032A","HYDR.SET DEUTZ AGROFARM 410-30",1220,1345.05,"17032A"]
["17033A","HYDR.SET DEUTZ AGROFARM 80-100",1220,1345.05,"17033A"]
["17040A","HYDR.SET ZETOR PROXIMA",1220,1345.05,"17040A"]
["17041A","HYDR.SET KUBOTA 5040-9540",1220,1345.05,"17041A"]
["17042A","HYDR.SET JD 6D",1220,1345.05,"17042A"]
["17043A","HYDR.SET  MCC/LAND CL/TEC",1220,1345.05,"17043A"]
["17044A","HYDR.SET ZETOR PROXIMA PLUS",1220,1345.05,"17044A"]
["17046A","HYDR.SET VALTRA A-MOD -92",1220,1345.05,"17046A"]
["17052A","HYDR.SET CNH TL70-100",1220,1345.05,"17052A"]
["17061A","HYDR.SET KUBOTA M8540-M9540",1220,1345.05,"17061A"]
["17062A","HYDR.SET KUBOTA M8540-M9540",1220,1345.05,"17062A"]
["17064A","HYDR.SET KUBOTA",1220,1345.05,"17064A"]
["17068A","HYDR.SET KUBOTA",1220,1345.05,"17068A"]
["17071A","HYDR.SET Deutz",1220,1345.05,"17071A"]
["17072A","HYDR.SET JD 5425-5525N",1220,1345.05,"17072A"]
["17073A","HYDR.SET MF 4225-4365",1220,1345.05,"17073A"]
["17076A","HYDR.SET CNH T4/FARMALL C",1220,1345.05,"17076A"]
["17085B","HYDR.SET MF2605/2615/2625/2635",1220,1345.05,"17085B"]
["17088A","HYDR.SET JD 6000",1220,1345.05,"17088A"]
["17093A","HYDR.SET KUBOTA M8560-9560",1220,1345.05,"17093A"]
["18001A","CBL VLV BOOMER 4055",980,1080.45,"18001A"]
["18002B","DIR VLV BOOMER 4055",794,875.3850000000001,"18002B"]
["18005B","DIR VLV BOOMER 1030",794,875.3850000000001,"18005B"]
["18006A","CBL VLV MA 5035",980,1080.45,"18006A"]
["18010B","DIR MF 2600",794,875.3850000000001,"18010B"]
["18014B","DIR KU MX",794,{"$f":"C1539*1.05*1.05","v":875.3850000000001},"18014B"]
["18015B","DIR VLV JD 5045D",794,875.3850000000001,"18015B"]
["18018B","HYDR SET FOTON 404-504",794,875.3850000000001,"18018B"]
["18019B","HYDR SET FOTON 354",794,875.3850000000001,"18019B"]
["18022B","DIR KU L2800-L3901",794,{"$f":"C1543*1.05*1.05","v":875.3850000000001},"18022B"]
["27001D","HOSE KIT",277,305.39250000000004,"27001D"]
["27009D","HOSEKIT",277,305.39250000000004,"27009D"]
["27010D","HOSE KIT",277,305.39250000000004,"27010D"]
["27016D","HOSE HIT",277,305.39250000000004,"27016D"]
["27017D","HOSE HIT",277,305.39250000000004,"27017D"]
["28001D","HOSE SET LCS",272,299.88000000000005,"28001D"]
["28001D","Hose Kit",272,299.88000000000005,"28001D"]
["28004D","HK MF 1500",272,299.88000000000005,"28004D"]
["28005D","HK MF 1535",272,299.88000000000005,"28005D"]
["28006D","HK MF GCS",272,299.88000000000005,"28006D"]
["28007D","HK MA 5010",272,299.88000000000005,"28007D"]
["28011D","HK KIOTI CK",272,299.88000000000005,"28011D"]
["28012D","HK KIOTI DK 40-50",272,299.88000000000005,"28012D"]
["28013D","HK KIOTI DK 55",272,299.88000000000005,"28013D"]
["28014B","DIR KU L SER",794,875.3850000000001,"28014B"]
["28014D","HK KU L SER",272,299.88000000000005,"28014D"]
["28017D","HK LA/MC 30-35 SER",272,299.88000000000005,"28017D"]
["28018D","HK LA/MC 25 SER",272,299.88000000000005,"28018D"]
["28020D","HK KU B SER",272,299.88000000000005,"28020D"]
["50220297F","EURO - SKID STEER ADAPTOR",803,885.30750000000012,"50220297F"]
["5102162F","Switch Kit",170,187.42500000000001,"5102162F"]
["5201117-1","SKID STEER TOOL CARRIER - DM",719,792.6975000000001,"5201117-1"]
["5220297F","ADAPTOR EURO-SKID STEER WELDED",803,885.30750000000012,"5220297F"]
["5220302-1","EURO TOOL CARRIER - DS",1088,1199.5200000000002,"5220302-1"]
["5220312-1","EURO TOOL CARRIER - DM",1088,1199.5200000000002,"5220312-1"]
["5220447-1","SKID STEER TOOL CARRIER - DM",1088,1199.5200000000002,"5220447-1"]
["5220449-1","SKID STEER TOOL CARRIER - DS",1088,1199.5200000000002,"5220449-1"]
["5221158-1","EURO TOOL CARRIER (Versa X) - Black",1088,1199.5200000000002,"5221158-1"]
["5221281-1","SKID STEER TOOL CARRIER (Versa X) - Black",1088,1199.5200000000002,"5221281-1"]
["5222158-1","EURO TOOL CARRIER - BLACK",1088,1199.5200000000002,"5222158-1"]
["5222158-1","EURO TOOL CARRIER - DM, US (Versa X)",1088,1199.5200000000002,"5222158-1"]
["CA10A1C0000CC","Q100N LOADER  LAN  PIN ON",1652,1821.3300000000002,"CA10A1C0000CC"]
["CA10A1C0000DD","Q100N LOADER  CIH  PIN ON",1652,1821.3300000000002,"CA10A1C0000DD"]
["CA10A1C0000FF","Q100N LOADER  NH  PIN ON",1652,1821.3300000000002,"CA10A1C0000FF"]
["CA10A1C0000GG","Q100N LOADER  JD  PIN ON",1652,1821.3300000000002,"CA10A1C0000GG"]
["CA10A1C0000JJ","Q100N LOADER  MC  PIN ON",1652,1821.3300000000002,"CA10A1C0000JJ"]
["100C","Q100N LOADER  KUBOTA  PIN ON",1652,1821.3300000000002,"100C"]
["CA10A1C0000MM","Q100N LOADER  MF  PIN ON",1652,1821.3300000000002,"CA10A1C0000MM"]
["CA10A1C0000QQ","Q100N LOADER  QUICKE   PIN ON",1652,1821.3300000000002,"CA10A1C0000QQ"]
["CA12A6C0000KK","Q120N LOADER KUBOTA PIN ON",1652,1821.3300000000002,"CA12A6C0000KK"]
["140C","Q140N LOADER  LAN  PIN ON",2522,2780.5050000000001,"140C"]
["CA14A1C0000DD","Q140N LOADER  CIH  PIN ON",2522,2780.5050000000001,"CA14A1C0000DD"]
["CA14A1C0000FF","Q140N LOADER  NH  PIN ON",2522,2780.5050000000001,"CA14A1C0000FF"]
["CA14A1C0000GG","Q140N LOADER  JD  PIN ON",2522,2780.5050000000001,"CA14A1C0000GG"]
["CA14A1C0000JJ","Q140N LOADER  MC  PIN ON",2522,2780.5050000000001,"CA14A1C0000JJ"]
["CA14A1C0000KK","Q140N LOADER  KUBOTA  PIN ON",2522,2780.5050000000001,"CA14A1C0000KK"]
["CA14A1C0000MM","Q140N LOADER  MF  PIN ON",2522,2780.5050000000001,"CA14A1C0000MM"]
["CA14A1C0000QQ","Q140N LOADER  QUICKE   PIN ON",2522,2780.5050000000001,"CA14A1C0000QQ"]
["160C","Q160N LOADER  LAN  Skid Steer",3435,3787.0875000000001,"160C"]
["CA16N1C1000DD","Q160N LOADER  CIH  Skid Steer",3435,3787.0875000000001,"CA16N1C1000DD"]
["CA16N1C1000FF","Q160N LOADER  NH  Skid Steer",3435,3787.0875000000001,"CA16N1C1000FF"]
["CA16N1C1000GG","Q160N LOADER  JD  Skid Steer",3435,3787.0875000000001,"CA16N1C1000GG"]
["CA16N1C1000JJ","Q160N LOADER  MC  Skid Steer",3435,3787.0875000000001,"CA16N1C1000JJ"]
["CA16N1C1000KK","Q160N LOADER  KUBOTA  Skid Steer",3435,3787.0875000000001,"CA16N1C1000KK"]
["CA16N1C1000MM","Q160N LOADER  MF  Skid Steer",3435,3787.0875000000001,"CA16N1C1000MM"]
["CA16N1C1000QQ","Q160N LOADER  QUICKE Skid Steer",3435,3787.0875000000001,"CA16N1C1000QQ"]
["CA16N1C8000CC","Q160N LOADER  LAN  Skid Steer",3435,3787.0875000000001,"CA16N1C8000CC"]
["CA16N1C8000DD","Q160N LOADER  CIH  Skid Steer",3435,3787.0875000000001,"CA16N1C8000DD"]
["CA16N1C8000FF","Q160N LOADER  NH  Skid Steer",3435,3787.0875000000001,"CA16N1C8000FF"]
["CA16N1C8000GG","Q160N LOADER  JD  Skid Steer",3435,3787.0875000000001,"CA16N1C8000GG"]
["CA16N1C8000JJ","Q160N LOADER  MC  Skid Steer",3435,{"$f":"C1604*1.05*1.05","v":3787.0875000000001},"CA16N1C8000JJ"]
["CA16N1C8000KK","Q160N LOADER  KUBOTA  Skid Steer",3435,3787.0875000000001,"CA16N1C8000KK"]
["CA16N1C8000MM","Q160N LOADER  MF  Skid Steer",3435,3787.0875000000001,"CA16N1C8000MM"]
["CA16N1C8000QQ","Q160N LOADER  QUICKE Skid Steer",3435,3787.0875000000001,"CA16N1C8000QQ"]
["180C","Q180N LOADER  LAN  Skid Steer",3784,4171.8600000000006,"180C"]
["CA18N1C1000DD","Q180N LOADER  CIH  Skid Steer",3784,4171.8600000000006,"CA18N1C1000DD"]
["CA18N1C1000FF","Q180N LOADER  NH  Skid Steer",3784,4171.8600000000006,"CA18N1C1000FF"]
["CA18N1C1000GG","Q180N LOADER  JD  Skid Steer",3784,4171.8600000000006,"CA18N1C1000GG"]
["CA18N1C1000JJ","Q180N LOADER  MC  Skid Steer",3784,4171.8600000000006,"CA18N1C1000JJ"]
["CA18N1C1000KK","Q180N LOADER  KUBOTA  Skid Steer",3784,4171.8600000000006,"CA18N1C1000KK"]
["CA18N1C1000MM","Q180N LOADER  MF  Skid Steer",3784,4171.8600000000006,"CA18N1C1000MM"]
["CA18N1C1000QQ","Q180N LOADER  QUICKE Skid Steer",3784,4171.8600000000006,"CA18N1C1000QQ"]
["CA18N1C8000CC","Q180N LOADER  LAN  Skid Steer",3784,4171.8600000000006,"CA18N1C8000CC"]
["CA18N1C8000DD","Q180N LOADER  CIH  Skid Steer",3784,4171.8600000000006,"CA18N1C8000DD"]
["CA18N1C8000FF","Q180N LOADER  NH  Skid Steer",3784,4171.8600000000006,"CA18N1C8000FF"]
["CA18N1C8000GG","Q180N LOADER  JD  Skid Steer",3784,4171.8600000000006,"CA18N1C8000GG"]
["CA18N1C8000JJ","Q180N LOADER  MC  Skid Steer",3784,4171.8600000000006,"CA18N1C8000JJ"]
["CA18N1C8000KK","Q180N LOADER  KUBOTA  Skid Steer",3784,4171.8600000000006,"CA18N1C8000KK"]
["CA18N1C8000MM","Q180N LOADER  MF  Skid Steer",3784,4171.8600000000006,"CA18N1C8000MM"]
["CA18N1C8000QQ","Q180N LOADER  QUICKE Skid Steer",3784,4171.8600000000006,"CA18N1C8000QQ"]
["PA20N1B1000DD","200N LOADER BM Case Red SSL",4015,4426.5375000000004,"PA20N1B1000DD"]
["PA20N1B1000FF","200N LOADER BM NH Blue SSL",4015,4426.5375000000004,"PA20N1B1000FF"]
["PA20N1B1000GG","200N LOADER BM JD Green SSL",4015,4426.5375000000004,"PA20N1B1000GG"]
["PA20N1B1000JJ","200N LOADER BM Mc Red SSL",4015,4426.5375000000004,"PA20N1B1000JJ"]
["PA20N1B1000KK","200N LOADER BM KU Orange SSL",4015,4426.5375000000004,"PA20N1B1000KK"]
["PA20N1B1000MM","200N LOADER BM MF Red SSL",4015,4426.5375000000004,"PA20N1B1000MM"]
["PA20N1B1000QQ","200N LOADER BM Quicke Grey SSL",4015,4426.5375000000004,"PA20N1B1000QQ"]
["PA20N1B8000DD","200N LOADER BM Case Red EURO",4015,4426.5375000000004,"PA20N1B8000DD"]
["PA20N1B8000FF","200N LOADER BM NH Blue EURO",4015,4426.5375000000004,"PA20N1B8000FF"]
["PA20N1B8000GG","200N LOADER BM JD Green EURO",4015,4426.5375000000004,"PA20N1B8000GG"]
["PA20N1B8000JJ","200N LOADER BM Mc Red EURO",4015,4426.5375000000004,"PA20N1B8000JJ"]
["PA20N1B8000KK","200N LOADER BM KU Orange EURO",4015,4426.5375000000004,"PA20N1B8000KK"]
["PA20N1B8000MM","200N LOADER BM MF Red EURO",4015,4426.5375000000004,"PA20N1B8000MM"]
["PA20N1B8000QQ","200N LOADER BM Quicke Grey EURO",4015,4426.5375000000004,"PA20N1B8000QQ"]
["PA20P1B1000DD","200P LOADER BM Case Red SSL",5071,5590.7775000000001,"PA20P1B1000DD"]
["PA20P1B1000FF","200P LOADER BM NH Blue SSL",5071,5590.7775000000001,"PA20P1B1000FF"]
["PA20P1B1000GG","200P LOADER BM JD Green SSL",5071,5590.7775000000001,"PA20P1B1000GG"]
["PA20P1B1000JJ","200P LOADER BM Mc Red SSL",5071,5590.7775000000001,"PA20P1B1000JJ"]
["PA20P1B1000KK","200P LOADER BM KU Orange SSL",5071,5590.7775000000001,"PA20P1B1000KK"]
["PA20P1B1000MM","200P LOADER BM MF Red SSL",5071,5590.7775000000001,"PA20P1B1000MM"]
["PA20P1B1000QQ","200P LOADER BM Quicke Grey SSL",5071,5590.7775000000001,"PA20P1B1000QQ"]
["PA20P1B8000DD","200P LOADER BM Case Red EURO",5071,5590.7775000000001,"PA20P1B8000DD"]
["PA20P1B8000FF","200P LOADER BM NH Blue EURO",5071,5590.7775000000001,"PA20P1B8000FF"]
["PA20P1B8000GG","200P LOADER BM JD Green EURO",5071,5590.7775000000001,"PA20P1B8000GG"]
["PA20P1B8000JJ","200P LOADER BM Mc Red EURO",5071,5590.7775000000001,"PA20P1B8000JJ"]
["PA20P1B8000KK","200P LOADER BM KU Orange EURO",5071,5590.7775000000001,"PA20P1B8000KK"]
["PA20P1B8000MM","200P LOADER BM MF Red EURO",5071,5590.7775000000001,"PA20P1B8000MM"]
["PA20P1B8000QQ","200P LOADER BM Quicke Grey EURO",5071,5590.7775000000001,"PA20P1B8000QQ"]
["PA22N1B1000DD","220N LOADER BM Case Red SSL",4183,4611.7575000000006,"PA22N1B1000DD"]
["PA22N1B1000FF","220N LOADER BM NH Blue SSL",4183,4611.7575000000006,"PA22N1B1000FF"]
["PA22N1B1000GG","220N LOADER BM JD Green SSL",4183,4611.7575000000006,"PA22N1B1000GG"]
["PA22N1B1000JJ","220N LOADER BM Mc Red SSL",4183,4611.7575000000006,"PA22N1B1000JJ"]
["PA22N1B1000KK","220N LOADER BM KU Orange SSL",4183,4611.7575000000006,"PA22N1B1000KK"]
["PA22N1B1000MM","220N LOADER BM MF Red SSL",4183,4611.7575000000006,"PA22N1B1000MM"]
["PA22N1B1000QQ","220N LOADER BM Quicke Grey SSL",4183,4611.7575000000006,"PA22N1B1000QQ"]
["PA22N1B800011","Q220N EURO",4015,4426.5375000000004,"PA22N1B800011"]
["PA22N1B8000DD","220N LOADER BM Case Red EURO",4183,4611.7575000000006,"PA22N1B8000DD"]
["PA22N1B8000FF","220N LOADER BM NH Blue EURO",4183,4611.7575000000006,"PA22N1B8000FF"]
["PA22N1B8000GG","220N LOADER BM JD Green EURO",4183,4611.7575000000006,"PA22N1B8000GG"]
["PA22N1B8000JJ","220N LOADER BM Mc Red EURO",4183,4611.7575000000006,"PA22N1B8000JJ"]
["PA22N1B8000KK","220N LOADER BM KU Orange EURO",4183,4611.7575000000006,"PA22N1B8000KK"]
["PA22N1B8000MM","220N LOADER BM MF Red EURO",4183,4611.7575000000006,"PA22N1B8000MM"]
["PA22N1B8000QQ","220N LOADER BM Quicke Grey EURO",4183,4611.7575000000006,"PA22N1B8000QQ"]
["PA22P1B1000DD","220P LOADER BM Case Red SSL",5258,5796.9450000000006,"PA22P1B1000DD"]
["PA22P1B1000FF","220P LOADER BM NH Blue SSL",5258,{"$f":"C1668*1.05*1.05","v":5796.9450000000006},"PA22P1B1000FF"]
["PA22P1B1000GG","220P LOADER BM JD Green SSL",5258,5796.9450000000006,"PA22P1B1000GG"]
["PA22P1B1000JJ","220P LOADER BM Mc Red SSL",5258,5796.9450000000006,"PA22P1B1000JJ"]
["PA22P1B1000KK","220P LOADER BM KU Orange SSL",5258,5796.9450000000006,"PA22P1B1000KK"]
["PA22P1B1000MM","220P LOADER BM MF Red SSL",5258,5796.9450000000006,"PA22P1B1000MM"]
["PA22P1B1000QQ","220P LOADER BM Quicke Grey SSL",5258,5796.9450000000006,"PA22P1B1000QQ"]
["PA22P1B8000DD","220P LOADER BM Case Red EURO",5258,5796.9450000000006,"PA22P1B8000DD"]
["PA22P1B8000FF","220P LOADER BM NH Blue EURO",5258,5796.9450000000006,"PA22P1B8000FF"]
["PA22P1B8000GG","220P LOADER BM JD Green EURO",5258,5796.9450000000006,"PA22P1B8000GG"]
["PA22P1B8000JJ","220P LOADER BM Mc Red EURO",5258,5796.9450000000006,"PA22P1B8000JJ"]
["PA22P1B8000KK","220P LOADER BM KU Orange EURO",5258,5796.9450000000006,"PA22P1B8000KK"]
["PA22P1B8000MM","220P LOADER BM MF Red EURO",5258,5796.9450000000006,"PA22P1B8000MM"]
["PA22P1B8000QQ","220P LOADER BM Quicke Grey EURO",5258,5796.9450000000006,"PA22P1B8000QQ"]
["PA24N1B100011","Q240N SSL",4626,5100.165,"PA24N1B100011"]
["PA24N1B1000DD","240N LOADER BM Case Red SSL",4626,5100.165,"PA24N1B1000DD"]
["PA24N1B1000FF","240N LOADER BM NH Blue SSL",4626,5100.165,"PA24N1B1000FF"]
["PA24N1B1000GG","240N LOADER BM JD Green SSL",4626,5100.165,"PA24N1B1000GG"]
["PA24N1B1000JJ","240N LOADER BM Mc Red SSL",4626,5100.165,"PA24N1B1000JJ"]
["PA24N1B1000KK","240N LOADER BM KU Orange SSL",4626,5100.165,"PA24N1B1000KK"]
["PA24N1B1000MM","240N LOADER BM MF Red SSL",4626,5100.165,"PA24N1B1000MM"]
["PA24N1B1000QQ","240N LOADER BM Quicke Grey SSL",4626,5100.165,"PA24N1B1000QQ"]
["PA24N1B800011","Q240N EURO",4626,5100.165,"PA24N1B800011"]
["PA24N1B8000DD","240N LOADER BM Case Red EURO",4626,5100.165,"PA24N1B8000DD"]
["PA24N1B8000FF","240N LOADER BM NH Blue EURO",4626,5100.165,"PA24N1B8000FF"]
["PA24N1B8000GG","240N LOADER BM JD Green EURO",4626,5100.165,"PA24N1B8000GG"]
["PA24N1B8000JJ","240N LOADER BM Mc Red EURO",4626,5100.165,"PA24N1B8000JJ"]
["PA24N1B8000KK","240N LOADER BM KU Orange EURO",4626,5100.165,"PA24N1B8000KK"]
["PA24N1B8000MM","240N LOADER BM MF Red EURO",4626,5100.165,"PA24N1B8000MM"]
["PA24N1B8000QQ","240N LOADER BM Quicke Grey EURO",4626,5100.165,"PA24N1B8000QQ"]
["PA24P1B1000DD","240P LOADER BM Case Red SSL",5757,6347.0925000000007,"PA24P1B1000DD"]
["PA24P1B1000FF","240P LOADER BM NH Blue SSL",5757,6347.0925000000007,"PA24P1B1000FF"]
["PA24P1B1000GG","240P LOADER BM JD Green SSL",5757,6347.0925000000007,"PA24P1B1000GG"]
["PA24P1B1000JJ","240P LOADER BM Mc Red SSL",5757,6347.0925000000007,"PA24P1B1000JJ"]
["PA24P1B1000KK","240P LOADER BM KU Orange SSL",5757,6347.0925000000007,"PA24P1B1000KK"]
["PA24P1B1000MM","240P LOADER BM MF Red SSL",5757,6347.0925000000007,"PA24P1B1000MM"]
["PA24P1B1000QQ","240P LOADER BM Quicke Grey SSL",5757,6347.0925000000007,"PA24P1B1000QQ"]
["PA24P1B8000DD","240P LOADER BM Case Red EURO",5757,6347.0925000000007,"PA24P1B8000DD"]
["PA24P1B8000FF","240P LOADER BM NH Blue EURO",5757,6347.0925000000007,"PA24P1B8000FF"]
["PA24P1B8000GG","240P LOADER BM JD Green EURO",5757,6347.0925000000007,"PA24P1B8000GG"]
["PA24P1B8000JJ","240P LOADER BM Mc Red EURO",5757,6347.0925000000007,"PA24P1B8000JJ"]
["PA24P1B8000KK","240P LOADER BM KU Orange EURO",5757,6347.0925000000007,"PA24P1B8000KK"]
["PA24P1B8000MM","240P LOADER BM MF Red EURO",5757,6347.0925000000007,"PA24P1B8000MM"]
["PA24P1B8000QQ","240P LOADER BM Quicke Grey EURO",5757,6347.0925000000007,"PA24P1B8000QQ"]
["PA26N1B1000DD","260N LOADER BM Case Red SSL",5071,5590.7775000000001,"PA26N1B1000DD"]
["PA26N1B1000FF","260N LOADER BM NH Blue SSL",5071,5590.7775000000001,"PA26N1B1000FF"]
["PA26N1B1000GG","260N LOADER BM JD Green SSL",5071,5590.7775000000001,"PA26N1B1000GG"]
["PA26N1B1000JJ","260N LOADER BM Mc Red SSL",5071,5590.7775000000001,"PA26N1B1000JJ"]
["PA26N1B1000KK","260N LOADER BM KU Orange SSL",5071,5590.7775000000001,"PA26N1B1000KK"]
["PA26N1B1000MM","260N LOADER BM MF Red SSL",5071,5590.7775000000001,"PA26N1B1000MM"]
["PA26N1B1000QQ","260N LOADER BM Quicke Grey SSL",5071,5590.7775000000001,"PA26N1B1000QQ"]
["PA26N1B8000DD","260N LOADER BM Case Red EURO",5071,5590.7775000000001,"PA26N1B8000DD"]
["PA26N1B8000FF","260N LOADER BM NH Blue EURO",5071,5590.7775000000001,"PA26N1B8000FF"]
["PA26N1B8000GG","260N LOADER BM JD Green EURO",5071,5590.7775000000001,"PA26N1B8000GG"]
["PA26N1B8000JJ","260N LOADER BM Mc Red EURO",5071,5590.7775000000001,"PA26N1B8000JJ"]
["PA26N1B8000KK","260N LOADER BM KU Orange EURO",5071,5590.7775000000001,"PA26N1B8000KK"]
["PA26N1B8000MM","260N LOADER BM MF Red EURO",5071,5590.7775000000001,"PA26N1B8000MM"]
["PA26N1B8000QQ","260N LOADER BM Quicke Grey EURO",5071,5590.7775000000001,"PA26N1B8000QQ"]
["PA26P1B1000DD","260P LOADER BM Case Red SSL",6256,6897.2400000000007,"PA26P1B1000DD"]
["PA26P1B1000FF","260P LOADER BM NH Blue SSL",6256,6897.2400000000007,"PA26P1B1000FF"]
["PA26P1B1000GG","260P LOADER BM JD Green SSL",6256,6897.2400000000007,"PA26P1B1000GG"]
["PA26P1B1000JJ","260P LOADER BM Mc Red SSL",6256,6897.2400000000007,"PA26P1B1000JJ"]
["PA26P1B1000KK","260P LOADER BM KU Orange SSL",6256,6897.2400000000007,"PA26P1B1000KK"]
["PA26P1B1000MM","260P LOADER BM MF Red SSL",6256,6897.2400000000007,"PA26P1B1000MM"]
["PA26P1B1000QQ","260P LOADER BM Quicke Grey SSL",6256,6897.2400000000007,"PA26P1B1000QQ"]
["PA26P1B8000DD","260P LOADER BM Case Red EURO",6256,{"$f":"C1732*1.05*1.05","v":6897.2400000000007},"PA26P1B8000DD"]
["PA26P1B8000FF","260P LOADER BM NH Blue EURO",6256,6897.2400000000007,"PA26P1B8000FF"]
["PA26P1B8000GG","260P LOADER BM JD Green EURO",6256,6897.2400000000007,"PA26P1B8000GG"]
["PA26P1B8000JJ","260P LOADER BM Mc Red EURO",6256,6897.2400000000007,"PA26P1B8000JJ"]
["PA26P1B8000KK","260P LOADER BM KU Orange EURO",6256,6897.2400000000007,"PA26P1B8000KK"]
["PA26P1B8000MM","260P LOADER BM MF Red EURO",6256,6897.2400000000007,"PA26P1B8000MM"]
["PA26P1B8000QQ","260P LOADER BM Quicke Grey EURO",6256,6897.2400000000007,"PA26P1B8000QQ"]
["PQ22N1B8000QQ","Q220N EURO",4183,4611.7575000000006,"PQ22N1B8000QQ"]
["Q21",null,4813,5306.3325000000004,"Q21"]
["Q26",null,7283,8029.5075000000006,"Q26"]
["Q31","Q31 LOADER  BASIC US  Quicke Grey  SSL",5243,5780.4075000000012,"Q31"]
["Q36","Q36 LOADER  BASIC US  Quicke Grey  SSL",8162,8998.6050000000014,"Q36"]
["Q41","Q41 LOADER  BASIC US  Quicke Grey  SSL",6523,7191.607500000001,"Q41"]
["Q46","Q46 LOADER  BASIC US  Quicke Grey  SSL",8709,9601.6725000000006,"Q46"]
["Q51","Q51 LOADER  BASIC US  Quicke Grey EURO",6867,7570.8675000000003,"Q51"]
["Q56","Q56 LOADER  BASIC US  Quicke Grey EURO",9805,10810.012500000001,"Q56"]
["Q61","Q61 LOADER DM  Quicke Grey EURO  MC4",8534,9408.7350000000006,"Q61"]
["Q66",null,10196,11241.090000000002,"Q66"]
["Q76","Q76 LOADER  BASIC UM  Quicke Grey EURO",10848,11959.92,"Q76"]
["Q88","Q88  LOADER DL  Quicke Grey EURO  MC4",14502,15988.455000000002,"Q88"]
["Q98","Q98 LOADER DXL  JD Green EURO  MC4",16792,18513.180000000004,"Q98"]
["X21","QUICKE  X21 LOADER  EURO  FLAT FACE DELUX PIN  QUICKE GREY",3690,4068.2250000000004,"X21"]
["X26","QUICKE  X26 LOADER  EURO  FLAT FACE DELUX PIN  QUICKE GREY",4745,5231.3625000000002,"X26"]
["X31","QUICKE X31 US LOADER EURO FLAT FACE DELUX PIN QUICKE GREY",3857,4252.3425000000007,"X31"]
["X36","QUICKE X36 US LOADER EURO FLAT FACE DELUX PIN QUICKE GREY",4934,5439.7349999999997,"X36"]
["X41","QUICKE X41 US LOADER EURO FLAT FACE DELUX PIN QUICKE GREY",4301,4741.8525,"X41"]
["X46","QUICKE X46 US LOADER EURO FLAT FACE DELUX PIN QUICKE GREY",5431,5987.6775000000007,"X46"]
["X51","QUICKE X51 US LOADER EURO FLAT FACE DELUX PIN QUICKE GREY",4745,5231.3625000000002,"X51"]
["X56","QUICKE X56 US LOADER EURO FLAT FACE DELUX PIN QUICKE GREY",5932,6540.0300000000007,"X56"]
[0,"-",0,0,0]
[14324885,"SUBF DM MF 5470-6470 T3",2596,2862.09,14324885]
[14328367,"KUBOTA M5 SUBFRAME",2219,2446.4475000000002,14328367]
[14328277,"SUBF KUBOTA M6-101,111 ",2596,2862.09,14328277]
[14328287,"SUBF KUBOTA M6-131,141 ",2596,2862.09,14328287]
["15420BEA","SUBF HYD SET KUBOTA M5",1494,1647.1350000000002,"15420BEA"]
["15421BAA","HYD SET KUBOTA M6",1494,1647.1350000000002,"15421BAA"]
["15421FCA","ELECTRODRIVE LCS",3451,3804.7275000000004,"15421FCA"]
["15007FCA","ELECTRODRIVE LCS",3451,3804.7275000000004,"15007FCA"]
["15013FCA","ELECTRODRIVE LCS",3451,3804.7275000000004,"15013FCA"]
["5221748-1","ToolCarrier 100 Series Euro",968,1067.22,"5221748-1"]
["5221741-1","ToolCarrier 100 Series Skid Steer",968,1067.22,"5221741-1"]
["15045FCA","ELECTRODRIVE LCS CNH T7000",3451,3804.7275000000004,"15045FCA"]
["11252211F","Log Grab New",1903,2098.0575000000003,"11252211F"]
["15286BEC","HYD SET CNH",1494,1647.1350000000002,"15286BEC"]
["ADDED",null,0,0,"ADDED"]
[14328584,"SUBF JD 6105-125 M/R",2596,2862.09,14328584]
["10378435D","HOSE KIT SPECIAL LCS ",530,584.32500000000005,"10378435D"]
[14328594,"SUBF JD 6130-6150 M/R",2596,2862.09,14328594]
[14328174,"SUBF JD 6170 - 6210 M/R",2596,2862.09,14328174]
["15406BAA","HYDRAULIC SET LCS JD",1494,1647.1350000000002,"15406BAA"]
["15406FCA","ELECTRODRIVE LCS",3451,3804.7275000000004,"15406FCA"]
[14328604,"SUBF JD5045-75E",2219,2446.4475000000002,14328604]
[14324855,"SUBF MF 5460 T3 DYNA 4",2219,2446.4475000000002,14324855]
[5044949,"MC-4 VERSA X",637,702.29250000000002,5044949]
[14328784,"5045E, 5055E, 5065E, 5075E (Teir 4)",2219,2446.4475000000002,"NEW!"]
["10378420D",null,530,584.32500000000005,"NEW"]
[14328944,"5085E, 5100E  (Teir4)",2219,2446.4475000000002,"NEW!!"]
[14328907,"SUBFR SET MCCORM XTX 145-165",3049,3361.5225000000005,14328907]
[60010001,"3rd Service X Series SL Loader with LCS",1034,1107,60010001]
[60010002,"3rd Service X Series NSL Loader with LCS",1034,1107,60010002]
[14220130,"Grille Guard JD 6R",361,385,14220130]
[14327694,"SUBFRAME SET TT65A-75A",2219,2375,14327694]
["15463BAA","HYD SET LCS NH",1494,1599,"15463BAA"]
[14120155,"SUBFRAME SET TC30",1034,1107,14120155]
["18038B","VALVE SET TC30",794,850,"18038B"]
[14110046,"Grille Guard ",281,{"$f":"C1797*1.05*1.05","v":309.80250000000001},14110046]
[14100585,"SUBFRAME SET Kubota L5740",1034,1107,14100585]
[14110046,"GRILL GUARD",281,301,14110046]
[60007293,"JOYSTICK BRACKET",118,127,60007293]
[14326737,"TS6.125,6.140 TIER 3-4",2596,2778,14326737]
[14328917,"SUBFRAME SET X7.440, 7.450",2616,2800,14328917]
["15389BEA","HYD SET LCS MCC X7 - PRO DRIVE",1494,1599,"15389BEA"]
["15389FCA","ELECTRODRIVE LCS MCC X7 - PRO DRIVE",3451,3693,"15389FCA"]
[14326617,"SUBFRAME SET CNH T4.85-95 bridge",2219,2375,14326617]
[14325957,"SUBFRAME SET CNH FARMALL U T4A&B",2219,2375,14325957]
[14324857,"Maxxum 115, 125, 140 - 6 CYL",2596,2778,14324857]
["15361BAA","HYD SET LCS NH",1494,1599,"15361BAA"]
["10378338D","HOSE SET LCS",530,568,"10378338D"]
["10378400M","HOSE SET LCS",638,682,"10378400M"]
[14327877,"Puma SWB TIER 4A /4B",3049,3263,14327877]
["11251754F","BALE SPIKE ATT",662,709,"11251754F"]
["11251698F","BALE SPIKE EURO",413,442,"11251698F"]
["11251694F","BALE SPIKE SSL",413,442,"11251694F"]
["11251720F","BIG BALE FORK SSL",553,592,"11251720F"]
["11251728F","BIG BALE FORK EURO",553,592,"11251728F"]
[14327177,"T5.95, 105,115 ELECTRO COMMAND 4A",2219,2375,14327177]
["11254065F","Bale Spike MKII Skid Steer",487,521,"11254065F"]
["11254051F","Bale Spike MKII Euro",487,521,"11254051F"]
[14325565,"SUBF SET DM MF 5410-5610",2616,2800,14325565]
["10378338M","HOSE SET LCS",638,682,"10378338M"]
[14100585,"SUBFRAME SET KUBOTA GRAND L 4 CYL",1034,1107,14100585]
[14340017,"SUBF SET DXL NH T8.",4298,4601,14340017]
["10378314M","HOSE SET LCS",638,682,"10378314M"]
["11252199F","48\" Pin On  (120C) C2",587,628,"11252199F"]
["11252200F","54\" Pin On (120C) C2",652,698,"11252200F"]
["11252201F","60\" Pin On (140C) C2",707,756,"11252201F"]
["11252203F","72\" Pin On (140C) C2",849,908,"11252203F"]
["11252207F","60\" Skid Steer (160-180C) C2",707,756,"11252207F"]
["11252208F","66\" Skid Steer (160-180C) C2",760,814,"11252208F"]
["11252209F","72\" Skid Steer (160-180C) C2",849,908,"11252209F"]
["11253974F","NA Pallet Fork 48\" Tine / 5500LB SSL",1288,1378,"11253974F"]
["11253978F","NA Pallet Fork 48\" Tine / 4400LB SSL",1082,1158,"11253978F"]
["11253988F","NA Pallet Fork 48\" Tine / 3300LB SSL",917,981,"11253988F"]
["11253992F","NA Pallet Fork 48\" Tine / 1760LB SSL",721,772,"11253992F"]
["11253975F","NA Pallet Fork 48\" Tine / 5500LB EURO",1288,1378,"11253975F"]
["11253979F","NA Pallet Fork 48\" Tine / 4400LB EURO",1082,1158,"11253979F"]
["11253989F","NA Pallet Fork 48\" Tine / 3300LB EURO",917,981,"11253989F"]
["11253993F","NA Pallet Fork 48\" Tine / 1760LB EURO",721,772,"11253993F"]
[14329094,"SUBFRAME SET JD6D AND E",3049,3263,14329094]
[14331194,"SUBFRAME SET CASE MAGNUM",3643,3900,14331194]
["27020D","HOSE.SET MFG 4600-SERIES",277,297,"27020D"]
[14327877,"SUBFRAME SET PUMA T4A/B",3049,3263,14327877]
[14328127,"SUBFRAME SET CNH FARMALL 90c-110c T4B",2219,2375,14328127]
["15298FCA","ELECTRODRIVE LCS CNH T6 T4B",3451,3693,"15298FCA"]
[14329024,"SUBFRAME SET JD",3049,3263,14329024]
[14220130,"Grille Guard JD",438,469,14220130]
["10378438M","HOSE SET LCS",638,682,"10378438M"]
[14324847,"SUBF SET MAXX 4CYL",2596,2778,14324847]
[14328824,"SUBFR SET KUBOTA M7",2616,2800,14328824]
["15464BAA","HYD SET LCS NH",1494,1599,"15464BAA"]
["15464FCA","ELECTRODRIVE LCS CNH T6 T4B",3451,3693,"15464FCA"]
[60011324,"Loader Ready Mounts",464,496,60011324]
["10378477D","HOSE SET LCS",530,568,"10378477D"]
[14329034,"SUBFRAME JD 6175M/R",3049,3263,14329034]
[14329234,"SUBFRAME DM 3930, 4630",2219,2375,14329234]
[14329257,"SUBFRAME SET KUBOTA M6S",2616,2800]
[14328824,"SUBFRAME SET KUBOTA M 7",2616,2800]
["15476BEA","ERGODRIVE LCS KUBOTA M6S",1494,1599]
["15421BAA","ERGODRIVE LCS KUBOTA M 7",1494,1599]
["15421FCA","ELECTRODRIVE LCS KUBOTA M 7",3451,3693]

{"sheet":"Notes","index":1,"n_rows":128,"n_cols":2,"rows_kept":128,"cut":false,"hidden":true,"merged":[]}
["Note #","Description"]
[]
[{"$f":"A2+1","v":1},"Hydraulic Set 15097BFA for Load Sense tractors "]
[{"$f":"A3+1","v":2},"Deluxe Hose Set  for use with factory blue joystick"]
[3,"Subframe adapted for tractors with/without 2.5 tonne front hitch"]
[4,"DS Subframe 900mm - order a DS Base Loader"]
[5,"For Tractors with Underslung Exhaust"]
[6,"For Tractors with Vertical Cab Corner Post Exhaust"]
[7,"Deluxe hose kit is only compatible prior to SN T262090"]
[8,"Front weight bracket must be removed"]
[9,"Not compatible with 60\" tread spacing and R30 tires"]
[10,"Order conversion kit #5034021 (new loader to older valves)  "]
[11,"US Width"]
[12,"UM Width"]
[13,"For Cab Tractors order hydraulic set 317204 "]
[14,"For tractors  without Bosch Valve or Power Beyond Plate use Hyd Set 15063BAC "]
[15,"For ROPS Tractors order Hyd Set 15076BAA "]
[16,"Subframe designed for Horizontal Exhaust only"]
[17,"Tractor must be equipped with Power Beyond Plate"]
[18,"Subframe includes Front Brackets only. If tractor does not have rear brackets, order 14321996 at $0 as well."]
[19,"Order Ergodrive 15325BAA load sensing for serial numbers up to 1008085 (2008) "]
[20,"Loader Q31/Q36 must be ordered with long bearing boxes for tractors with front wheels larger then 420/70 R24."]
[21,"If tractor has 75 litre hyd pump & no front-axle suspension, a special plug is needed for L-S signal.  Order from SDF: Ref No: 04454514.4."]
[22,"Hose kit 10377307C does not fit tractors with air pressure equipment."]
[23,"Tractors manufactured after 2006-09-01 and without front-axle suspension a special plug is needed for L-S signal.  Order from SDF: Ref No. 04454514.4."]
[24,"Hose kit 10378307C doesn't fit tractors equipped with adaptor plate at rear hydraulics for front hitch."]
[25,"For Tractors w/o Power beyond. Order  shuttle valve 2.3729.686.0 from SDF"]
[26,"Adapted for tractors with or without front axle suspension"]
[27,"If tractor is equipped with Sauter front hitch, contact Sauter for more information."]
[28,"Q41 and Q46 will fit if tires are less than 14.9X24"]
[29,"For Tractors built prior to 2004, use Hydraulic Set 15006BAA , also fits tractors built after 2004 with 3 remotes"]
[30,"To use hydraulic set, Non Premium Tractors must be equipped with John Deere Power Beyond Plate"]
[31,"For \"N\" Narrow only use Q21 or Q26"]
[32,"Q21, Q26 not compatible with the front weight bracket"]
[33,"Tractor must be equiped with JD power beyond plate # R259621 and adaptor set # RE251179."]
[34,"Q61/Q65 is compatible with 2WD"]
[35,"Order subframe 14324824 for tractors produced before SN 340001"]
[36,"If the tractor has a front hitch,order subframe 14326154 "]
[37,"If the tractor has a front hitch, order subframe 14326364"]
[38,"If the tractor has a front hitch, order subframe 14326314 "]
[39,"If the tractor has Zuidberg front hitch, order subframe 14340034 "]
[40,"Q51/Q56/Q58 is not compatible with front hitch."]
[41,"Required to order part # RE58763 & R196840 from JD for hydraulic connection."]
[42,"If tractor has original front linkage, use 14327334 "]
[43,"Subframe does not include Grill Guard. Order GG No.14220113 for tractors without front hitch. $0"]
[44,"Subframe does not include Grill Guard. Order GG No.14220114 for tractors with JD front hitch. $0"]
[45,"Power beyond plate for Hydraulic Set must be ordered from John Deere"]
[46,"Order conversion kit #5034021 (new loader to older valves)  "]
[47,"Hose kit serviced from rear remotes"]
[48,"Steering must be limited to accommodate for the subframe side rail"]
[49,"Joystick Bracket will need to be fabricated for Cab Tractors"]
[50,"For M5040 ROPS < SN 83013/M60/85/9540 ROPS < SN 21001 M7040 ROPS < SN 13001 / M6040 CAB < SN 83098 / M7040 CAB < SN 83151 / M8540 CAB < SN 83060  / M9540 CAB < SN 83314 - Order Hydraulic Kit No. 15124BEA "]
[51,"Low Profile models will require modifications to the underslung exhaust."]
[52,"Requires Retaining Fork Set 10348131 ($0)"]
[53,"Kubota front weight frame (M9265) has to be removed or modified"]
[54,"Will only fit FIXED front axle"]
[55,"Adapted for Models with Serial Number S"]
[56,"Will not fit Tractors with Tier 2 Green engines"]
[57,"If equipped with Bondioli and Pavesi rear remote valve and SN between BV11001 - BV33001, a metric PB sleeve (AGCO part # 6286183M1), adaptor #10 JIC female to #12 JIC male (Quicke part # 5028039 - $0) are required."]
[58,"For Steepnose Tractors order Grill Guard 14323661"]
[59,"Q31, Q36 only compatible with Front Tires 13.6XR24 or smaller"]
[60,"On Open Center Twin Flow Tractors combining valve cannot be used"]
[61,"For Load Sensing Tractors order Hydraulic Set 15097BFA. "]
[62,"Subframe adapted for tractors with or without front hitch"]
[63,"Order Hydraulic Set 15022BAA for Tractors with Open Center Hydraulic Systems. "]
[64,"On open center Twin Flow tractors combining valve cannot be used"]
[65,"Order hydraulic set 15020BAA for load sense tractors up to SN T008085. "]
[{"$f":"A67+1","v":66},"Order rear axle extension set 14100573. $311"]
[67,"Order 15100BFA for tractors after serial no T008085 with open centre hyd system. "]
[68,"Hose set Deluxe will only fit tractors with joystick in the armrest."]
[69,"Provide Tractor serial number at time of order"]
[70,"Please call Alo with tractor details to ensure correct subframe"]
[71,"Will not fit tractors with hydraulic connections in front of Cab or ROPS."]
[72,"Use 15174BAA for Open Center Hydraulic Systems. "]
[73,"Use 15106BAA for Open Center Hydraulic Systems on 6100 series or 317070 for Open Center on 3050 to 3065. "]
[74,"For Cab Tractors order hydraulic set 15102BAA. "]
[75,"Hydraulic Set is only compatible with the HUSCO rear remote valve"]
[76,"For tractors up to Serial Number 57260B 18014"]
[77,"For tractors greater than Serial Number 57260B 18014"]
[78,"For tractors greater than Serial Number C45009"]
[79,"For tractors up to Serial Number C45008"]
[80,"Q31, Q36 loaders are not recommended with tires larger than 13.6 X 24"]
[81,"15199BAA will fit ROPS and tractors with factory cab joystick.  Cab Tractors without factory joystick order 15197BAC. "]
[82,"For tractors without Bosch valve without a power beyond order Hydraulic Set 15063BAA. "]
[83,"For tractors without Bosch valve but with a Power Beyond plate between the 2nd and 3rd section, order Hydraulic Set 15044BAA. "]
[84,"On XTX215 Tractors with Serial Number less than JE3500994 use subframe 14320044. "]
[85,"Max Tire Size Q31-Q38 is 440 60R 24"]
[86,"Subframe will fit platform and footstep versions."]
[87,"Base loader requires Extended Bearing Boxes "]
[88,"The hydraulic sets don't fit the tractors with the hydraulic trailer brake valve."]
[89,"Tractors must be equipped with Power Beyond plate for the valve"]
[90,"Order Subframe set 14320725 for Serial Numbers prior to 116199B "]
[91,"Order Hyd Set 15087BAA for  Serial Numbers prior to 116199B "]
[92,"For open-center systems, use valve kit no. 15089BAA "]
[93,"Q61/66 must be ordered with extended bearing boxes for supersteer models only."]
[94,"If tractor does not have pre-installed connections to hydraulic auxillary valve, use 15024BAA. "]
[95,"Order P/B Plate from New Holland for Open Center Systems"]
[96,"Order 15231BAA Load Sense Valve for double pump tractors. "]
[97,"Order 15242BAA Load Sense Valve for double pump tractors. "]
[98,"Valve is serviced from the tractor remote valves"]
[99,"Subframe is manufactured in France.  Longer leadtimes should be expected.  Call for availability."]
["B1","Subframe designed for tractors with New Axle when Serial Number is >K36108 for 6000 series and >K41108 for 8000 series order adapter kit 10347271 ($155)"]
["B2","Hydraulic Set is designed for Hi Tech models or all chassis > Serial Number L17307"]
["B3","Subframe will fit all options except Zuidburg front hitch"]
["B4","Hydraulic Set joystick mounts on the left hand side."]
["B5","Subframe for tractor with or without Zuidberg front hitch"]
["B6","Order additional kit 14321621 for tractors before SN K36108 ($155)"]
["B7","Subframe includes Front Brackets only. If tractor does not have rear brackets, order 14322836 at $0 as well."]
["B8","Designed for tractors with under slung exhaust pipe."]
["B9","Will only fit 4wd tractors."]
[100,"Subframe includes Front Brackets only. If tractor does not have rear brackets, order 14322836 at $0 as well."]
[101,"The fuel line has to be modified on tractors fitted with dual fuel tanks. Rear axle extensions are not required on some models."]
[102,"Only fits tractors manufactured after Jan 1, 2008"]
[103,"Does not fit tractors with mid electric valves"]
[104,"Loader size Q66 and larger, NOT AVAILABLE IN MASSEY FERGUSON RED."]
["A1","Designed for Rops tractors or tractors with a factory cab"]
["A2","Subframe will not fit with mid mount mower"]
["A3","Designed for Rops Tractors only."]
["A4","Tractor must be equipped with factory joystick and valve"]
["A5","Order JD part no S1290468 to complete"]
["A6"]
["A7","Designed for tractors with Max front Wheel size 24x8.-12"]
["A8","Not Designed for Supersteer models"]
["A9","Order CNH part no. SBA340171000 to complete."]
["A10","Add Mechanical Self Levelling  160c - 5221797 180c - 5221798 "]
[105,"Does Not Fit TierIV Tractors"]
[106,"Subframe Does not include Subframe. Order Grille Guard 14220130 for tractors without front Linkage"]
["C5","If Tractor is not equipped with Loader ready mounts order 60011324 "]

{"sheet":"Implements","index":2,"n_rows":49,"n_cols":20,"rows_kept":49,"cut":false,"hidden":true,"merged":[]}
["EURO"]
["Q21","11254051F","11251728F","11252718F","11252738F","11252748F","11250768F","11250178F","11252008F","11252018F"]
["Q26","11254051F","11251728F","11252718F","11252738F","11252748F","11250768F","11250178F","11252008F","11252018F"]
["Q31","11254051F","11251728F","11252718F","11252738F","11252748F","11250768F","11250178F","11252008F","11252018F"]
["Q36","11254051F","11251728F","11252718F","11252738F","11252748F","11250768F","11250178F","11252008F","11252018F"]
["Q41","11254051F","11251728F","11252738F","11252748F","11250533F","11250536F","11250534F","11250537F","11250768F","11250358F","11252008F","11252018F",null,null,null,null,null,"11251698F","There is a special offer if you order 5 or more of this item!"]
["Q46","11254051F","11251728F","11252738F","11252748F","11250533F","11250536F","11250534F","11250537F","11250768F","11250358F","11252008F","11252018F",null,null,null,null,null,"11251728F","There is a special offer if you order 5 or more of this item!"]
["Q51","11254051F","11251728F","11252738F","11252748F","11250533F","11250536F","11250534F","11250537F","11250768F","11250358F","11252008F","11252018F",null,null,null,null,null,"11252738F",{"$f":"\"\"","v":""}]
["Q56","11254051F","11251728F","11252738F","11252748F","11250533F","11250536F","11250534F","11250537F","11250768F","11250358F","11252008F","11252018F",null,null,null,null,null,"11252748F",{"$f":"\"\"","v":""}]
["Q61","11254051F","11251728F","11252738F","11252748F","11250533F","11250536F","11250534F","11250537F","11250768F","11250358F","11252008F","11252018F",null,null,null,null,null,"11250533F",{"$f":"\"\"","v":""}]
["Q66","11254051F","11251728F","11252738F","11252748F","11250533F","11250536F","11250534F","11250537F","11250768F","11250358F","11252008F","11252018F",null,null,null,null,null,"11250536F",{"$f":"\"\"","v":""}]
["Q76","11254051F","11251728F","11252738F","11252748F","11250534F","11250537F","11250535F","11250538F","11250768F","11250358F","11252008F","11252018F",null,null,null,null,null,"11250534F",{"$f":"\"\"","v":""}]
["Q88","11254051F","11251728F","11252738F","11252748F","11250534F","11250537F","11250535F","11250538F","11250768F","11250358F","11252008F","11252018F",null,null,null,null,null,"11250537F",{"$f":"\"\"","v":""}]
["Q98","11254051F","11251728F","11252738F","11252748F","11262087F","11250768F","11250358F","11252008F","11252018F",null,null,null,null,null,null,null,null,"11250768F",{"$f":"\"\"","v":""}]
["160C","11254051F","11251728F","11252718F",null,null,null,null,null,null,null,null,null,null,null,null,null,null,"11250358F",{"$f":"\"\"","v":""}]
["180C","11254051F","11251728F","11252718F",null,null,null,null,null,null,null,null,null,null,null,null,null,null,"11252008F",{"$f":"\"\"","v":""}]
["X21","11254051F","11251728F","11252718F","11252738F","11252748F",null,null,null,null,null,null,null,null,null,null,null,null,"11252018F",{"$f":"\"\"","v":""}]
["X26","11254051F","11251728F","11252718F","11252738F","11252748F",null,null,null,null,null,null,null,null,null,null,null,null,"11254051F","There is a special offer if you order 5 or more of this item!"]
["X31","11254051F","11251728F","11252718F","11252738F","11252748F",null,null,null,null,null,null,null,null,null,null,null,null,"11254065F","There is a special offer if you order 5 or more of this item!"]
["X36","11254051F","11251728F","11252718F","11252738F","11252748F",null,null,null,null,null,null,null,null,null,null,null,null,"11252311F",{"$f":"\"\"","v":""}]
["X41","11254051F","11251728F","11252718F","11252738F","11252748F",null,null,null,null,null,null,null,null,null,null,null,null,"11252331F",{"$f":"\"\"","v":""}]
["X46","11254051F","11251728F","11252718F","11252738F","11252748F",null,null,null,null,null,null,null,null,null,null,null,null,"11252341F",{"$f":"\"\"","v":""}]
["X51","11254051F","11251728F","11252718F","11252738F","11252748F",null,null,null,null,null,null,null,null,null,null,null,null,"11251718F",{"$f":"\"\"","v":""}]
["X56","11254051F","11251728F","11252718F","11252738F","11252748F",null,null,null,null,null,null,null,null,null,null,null,null,"11250535F",{"$f":"\"\"","v":""}]
[null,null,null,null,null,null,null,null,null,null,null,null,null,null,null,null,null,null,"11250538F",{"$f":"\"\"","v":""}]
["Skid Steer"]
["Q21","11254065F","11251720F","11252311F","11252331F","11252341F"]
["Q26","11254065F","11251720F","11252311F","11252331F","11252341F"]
["Q31","11254065F","11251720F","11252311F","11252331F","11252341F"]
["Q36","11254065F","11251720F","11252311F","11252331F","11252341F"]
["Q41","11254065F","11251720F","11252311F","11252331F","11252341F"]
["Q46","11254065F","11251720F","11252311F","11252331F","11252341F"]
["Q51"]
["Q56"]
["Q61"]
["Q66"]
["Q76"]
["Q88"]
["Q98"]
["160C","11254065F","11251720F","11252311F"]
["180C","11254065F","11251720F","11252311F"]
["X21","11254065F","11251720F","11252311F","11252331F","11252341F"]
["X26","11254065F","11251720F","11252311F","11252331F","11252341F"]
["X31","11254065F","11251720F","11252311F","11252331F","11252341F"]
["X36","11254065F","11251720F","11252311F","11252331F","11252341F"]
["X41","11254065F","11251720F","11252311F","11252331F","11252341F"]
["X46","11254065F","11251720F","11252311F","11252331F","11252341F"]
["X51","11254065F","11251720F","11252311F","11252331F","11252341F"]
["X56","11254065F","11251720F","11252311F","11252331F","11252341F"]

{"sheet":"Buckets","index":3,"n_rows":53,"n_cols":10,"rows_kept":53,"cut":false,"hidden":true,"merged":[]}
["EURO Buckets"]
["Q21","11251588F","11251598F","11251038F","11251048F","11251128F","11251138F","11252158F",{"$f":"\"\"","v":""}]
["Q26","11251588F","11251598F","11251038F","11251048F","11251128F","11251138F","11252158F",{"$f":"\"\"","v":""}]
["Q31","11251588F","11251598F","11251038F","11251048F","11251128F","11251138F","11251078F","11251158F","11252158F"]
["Q36","11251588F","11251598F","11251038F","11251048F","11251128F","11251138F","11251078F","11251158F","11252158F"]
["Q41","11251038F","11251048F","11251058F","11251078F","11251148F","11251158F","11252158F",{"$f":"\"\"","v":""}]
["Q46","11251038F","11251048F","11251058F","11251078F","11251148F","11251158F","11252158F",{"$f":"\"\"","v":""}]
["Q51","11251038F","11251048F","11251058F","11251078F","11251088F","11251158F","11251808F","11252158F"]
["Q56","11251038F","11251048F","11251058F","11251078F","11251088F","11251158F","11251808F","11252158F"]
["Q61","11251048F","11251058F","11251078F","11251088F","11251808F","11251818F",{"$f":"\"\"","v":""},{"$f":"\"\"","v":""}]
["Q66","11251048F","11251058F","11251078F","11251088F","11251808F","11251818F",{"$f":"\"\"","v":""},{"$f":"\"\"","v":""}]
["Q76","11251048F","11251058F","11251078F","11251088F","11251098F","11251808F","11251818F","11251828F"]
["Q88","11251058F","11251088F","11251098F","11251818F","11251828F",null,{"$f":"\"\"","v":""},{"$f":"\"\"","v":""}]
["Q98","11251087F","11251097F",null,null,null,null,{"$f":"\"\"","v":""},{"$f":"\"\"","v":""}]
["160C","11251938F"]
["180C","11251938F"]
["X21","11251948F","11251958F","11251588F","11251598F","11251038F","11251048F",{"$f":"\"\"","v":""},{"$f":"\"\"","v":""}]
["X26","11251948F","11251958F","11251588F","11251598F","11251038F","11251048F",{"$f":"\"\"","v":""},{"$f":"\"\"","v":""}]
["X31","11251948F","11251958F","11251588F","11251598F","11251038F","11251048F",{"$f":"\"\"","v":""},{"$f":"\"\"","v":""}]
["X36","11251948F","11251958F","11251588F","11251598F","11251038F","11251048F",{"$f":"\"\"","v":""},{"$f":"\"\"","v":""}]
["X41","11251948F","11251958F","11251588F","11251598F","11251038F","11251048F","11251058F",{"$f":"\"\"","v":""}]
["X46","11251948F","11251958F","11251588F","11251598F","11251038F","11251048F","11251058F",{"$f":"\"\"","v":""}]
["X51","11251948F","11251958F","11251588F","11251598F","11251038F","11251048F","11251058F",{"$f":"\"\"","v":""}]
["X56","11251948F","11251958F","11251588F","11251598F","11251038F","11251048F","11251058F",{"$f":"\"\"","v":""}]
[]
["Skid Steer Buckets"]
["Q21","11251721F","11251821F"]
["Q26","11251721F","11251821F"]
["Q31","11251721F","11251821F"]
["Q36","11251721F","11251821F"]
["Q41","11251721F","11251821F"]
["Q46","11251721F","11251821F"]
["Q51"]
["Q56"]
["Q61"]
["Q66"]
["Q76"]
["Q88"]
["Q98"]
["160C","11251970F","11251921F","11251931F"]
["180C","11251970F","11251921F","11251931F"]
["X21","11251941F","11251951F","11251721F","11251821F"]
["X26","11251941F","11251951F","11251721F","11251821F"]
["X31","11251941F","11251951F","11251721F","11251821F"]
["X36","11251941F","11251951F","11251721F","11251821F"]
["X41","11251941F","11251951F","11251721F","11251821F"]
["X46","11251941F","11251951F","11251721F","11251821F"]
["X51","11251941F","11251951F","11251721F","11251821F"]
["X56","11251941F","11251951F","11251721F","11251821F"]
[]
["PIN ON BUCKETS"]
["100C","11251730F","11251740F"]
["140C","11251760F"]

{"sheet":"LOADERpro","index":4,"n_rows":122,"n_cols":36,"rows_kept":122,"cut":false,"hidden":false,"merged":[[2,2,2,7],[6,10,6,12],[4,10,4,12],[2,10,2,12],[4,8,4,9],[6,8,6,9],[2,8,2,9],[42,9,42,10],[8,10,8,12],[17,2,17,11],[20,2,20,14],[4,2,4,7],[16,6,16,7],[13,1,13,2],[11,1,11,2],[16,4,16,5],[8,5,8,6],[23,8,23,9],[37,9,37,10],[27,11,27,14],[30,11,30,14],[16,13,16,14],[6,2,6,7],[48,1,48,12],[36,12,36,14],[33,11,33,14],[31,11,31,14],[46,11,46,14],[46,9,46,10],[40,2,40,4],[32,9,32,10],[32,5,32,8],[47,9,47,11],[32,11,32,14],[44,11,45,14],[40,5,40,10],[44,9,45,10],[41,12,41,14],[42,11,42,14],[0,8,0,14],[18,2,18,14],[38,9,38,10],[33,2,33,8],[19,2,19,14],[35,2,35,4],[21,2,21,14],[31,9,31,10],[33,9,33,10],[35,5,35,10],[29,4,29,14],[28,9,28,10],[30,9,30,10],[35,11,35,14],[37,11,37,14],[38,11,38,14],[40,11,40,14],[23,10,23,12],[24,11,24,14],[26,11,26,14],[29,1,29,3],[28,11,28,14],[27,9,27,10],[25,11,25,14],[24,1,24,2],[25,1,25,2]]}
[null,null,null,null,null,null,null,null,"LOADERpro17.1"]
[]
[null,"Dealer Name:",null,null,null,null,null,null,"Date:",null,null,null,null,null,null,null,null,null,null,null,"Note 1",{"$f":"VLOOKUP(T$11,loaders,5,0)","v":{"$error":"#N/A"}},{"$f":"VLOOKUP(V3,notes,2,0)","v":{"$error":"#N/A"}}]
[null,null,null,null,null,null,null,null,null,null,null,null,null,null,null,null,null,null,null,null,"Note 2",{"$f":"VLOOKUP(T$11,loaders,6,0)","v":{"$error":"#N/A"}},{"$f":"VLOOKUP(V4,notes,2,0)","v":{"$error":"#N/A"}}]
[null,"Contact:",null,null,null,null,null,null,"P.O. No.",null,null,null,null,null,null,null,null,{"$f":"IF(VLOOKUP(P19,Options!A1:E25,4,0)>15,\"EURO\",\"\")","v":{"$error":"#N/A"}},null,null,"Note 3",{"$f":"VLOOKUP(T$11,loaders,7,0)","v":{"$error":"#N/A"}},{"$f":"VLOOKUP(V5,notes,2,0)","v":{"$error":"#N/A"}},{"$f":"IF(ISERROR(R5),\"\",R5)","v":""}]
[null,null,null,null,null,null,null,null,null,null,null,null,null,null,null,null,null,{"$f":"IF(VLOOKUP(P19,Options!A1:E25,4,0)<=15,\"\",IF(VLOOKUP(P19,Options!A1:E25,4,0)>=47,\"\",\"SKID STEER\"))","v":{"$error":"#N/A"}},null,null,"Note 4",{"$f":"VLOOKUP(T$11,loaders,8,0)","v":{"$error":"#N/A"}},{"$f":"VLOOKUP(V6,notes,2,0)","v":{"$error":"#N/A"}},{"$f":"IF(ISERROR(R6),\"\",R6)","v":""}]
[null,"Address:",null,null,null,null,null,null,"Dealer No.",null,null,null,null,null,null,null,null,{"$f":"IF(VLOOKUP(P19,Options!A1:E25,4,0)<15,\"PIN ON\",\"\")","v":{"$error":"#N/A"}},null,null,null,null,null,{"$f":"IF(ISERROR(R7),\"\",R7)","v":""}]
[]
[null,null,null,null,null,"State:",null,null,null,null,"Valid thru April 30, 2017"]
[null,null,null,null,null,null,null,null,null,null,null,null,null,null,null,null,null,null,"AGCO"]
[null,null,null,null,null,null,null,null,null,null,null,null,null,null,null,null,null,null,"AGCO Allis"]
[null,"Tractor Make:",null,null,null,null,null,null,null,null,null,null,null,null,null,null,null,null,"AGCO White",{"$f":"IF(S$26=\"AGCO\",AGCO!A1,IF(S$26=\"AGCO White\",'AGCO White'!A1,IF(S$26=\"AGCO Allis\",'AGCO Allis'!A1,IF(S$26=\"Buhler\",Buhler!A1,IF(S$26=\"Case IH\",Case!A1,IF(S$26=\"Challenger\",Challenger!A1,IF(S$26=\"Deutz\",Deutz!A1,IF(S$26=\"John Deere\",'John Deere'!A1,IF(S$26=\"Kubota\",Kubota!A1,IF(S$26=\"Landini\",Landini!A1,IF(S$26=\"Massey Ferguson\",MF!A1,IF(S$26=\"McCormick\",McCormick!A1,IF(S$26=\"New Holland\",NH!A1,IF(S$26=\"Kioti\",KIOTI!A1,IF(S$26=\"Mahindra\",MAHINDRA!A1,IF(S$26=\"Valtra\",Valtra!A1,IF(S$26=\"\",\"\",0)))))))))))))))))","v":""}]
[null,null,null,null,null,null,null,null,null,null,null,null,null,null,null,null,null,null,"Buhler",{"$f":"IF(S$26=\"AGCO\",AGCO!A2,IF(S$26=\"AGCO White\",'AGCO White'!A2,IF(S$26=\"AGCO Allis\",'AGCO Allis'!A2,IF(S$26=\"Buhler\",Buhler!A2,IF(S$26=\"Case IH\",Case!A2,IF(S$26=\"Challenger\",Challenger!A2,IF(S$26=\"Deutz\",Deutz!A2,IF(S$26=\"John Deere\",'John Deere'!A2,IF(S$26=\"Kubota\",Kubota!A2,IF(S$26=\"Landini\",Landini!A2,IF(S$26=\"Massey Ferguson\",MF!A2,IF(S$26=\"McCormick\",McCormick!A2,IF(S$26=\"New Holland\",NH!A2,IF(S$26=\"Kioti\",KIOTI!A2,IF(S$26=\"Mahindra\",MAHINDRA!A2,IF(S$26=\"Valtra\",Valtra!A2,IF(S$26=\"\",\"\",0)))))))))))))))))","v":""}]
[null,"Tractor Model:",null,null,null,null,null,null,null,null,null,null,null,null,null,null,{"$f":"VLOOKUP(T11,OEM,2,0)","v":{"$error":"#N/A"}},null,"Case IH",{"$f":"IF(S$26=\"AGCO\",AGCO!A3,IF(S$26=\"AGCO White\",'AGCO White'!A3,IF(S$26=\"AGCO Allis\",'AGCO Allis'!A3,IF(S$26=\"Buhler\",Buhler!A3,IF(S$26=\"Case IH\",Case!A3,IF(S$26=\"Challenger\",Challenger!A3,IF(S$26=\"Deutz\",Deutz!A3,IF(S$26=\"John Deere\",'John Deere'!A3,IF(S$26=\"Kubota\",Kubota!A3,IF(S$26=\"Landini\",Landini!A3,IF(S$26=\"Massey Ferguson\",MF!A3,IF(S$26=\"McCormick\",McCormick!A3,IF(S$26=\"New Holland\",NH!A3,IF(S$26=\"Kioti\",KIOTI!A3,IF(S$26=\"Mahindra\",MAHINDRA!A3,IF(S$26=\"Valtra\",Valtra!A3,IF(S$26=\"\",\"\",0)))))))))))))))))","v":""}]
[null,null,null,null,null,null,null,null,null,null,null,null,null,null,null,null,null,null,"Challenger",{"$f":"IF(S$26=\"AGCO\",AGCO!A4,IF(S$26=\"AGCO White\",'AGCO White'!A4,IF(S$26=\"AGCO Allis\",'AGCO Allis'!A4,IF(S$26=\"Buhler\",Buhler!A4,IF(S$26=\"Case IH\",Case!A4,IF(S$26=\"Challenger\",Challenger!A4,IF(S$26=\"Deutz\",Deutz!A4,IF(S$26=\"John Deere\",'John Deere'!A4,IF(S$26=\"Kubota\",Kubota!A4,IF(S$26=\"Landini\",Landini!A4,IF(S$26=\"Massey Ferguson\",MF!A4,IF(S$26=\"McCormick\",McCormick!A4,IF(S$26=\"New Holland\",NH!A4,IF(S$26=\"Kioti\",KIOTI!A4,IF(S$26=\"Mahindra\",MAHINDRA!A4,IF(S$26=\"Valtra\",Valtra!A4,IF(S$26=\"\",\"\",0)))))))))))))))))","v":""}]
[null,null,null,null,null,null,null,null,null,null,null,null,null,null,null,null,null,null,"Deutz",{"$f":"IF(S$26=\"AGCO\",AGCO!A5,IF(S$26=\"AGCO White\",'AGCO White'!A5,IF(S$26=\"AGCO Allis\",'AGCO Allis'!A5,IF(S$26=\"Buhler\",Buhler!A5,IF(S$26=\"Case IH\",Case!A5,IF(S$26=\"Challenger\",Challenger!A5,IF(S$26=\"Deutz\",Deutz!A5,IF(S$26=\"John Deere\",'John Deere'!A5,IF(S$26=\"Kubota\",Kubota!A5,IF(S$26=\"Landini\",Landini!A5,IF(S$26=\"Massey Ferguson\",MF!A5,IF(S$26=\"McCormick\",McCormick!A5,IF(S$26=\"New Holland\",NH!A5,IF(S$26=\"Kioti\",KIOTI!A5,IF(S$26=\"Mahindra\",MAHINDRA!A5,IF(S$26=\"Valtra\",Valtra!A5,IF(S$26=\"\",\"\",0)))))))))))))))))","v":""}]
[null,"Tractor Specifics:",null,null,"Version:",null,{"$f":"IF(ISERROR(VLOOKUP(T11,loaders,3,0)),\"\",VLOOKUP(T11,loaders,3,0))","v":""},null,null,{"$f":"IF(ISERROR(VLOOKUP(T11,loaders,2,0)),\"\",VLOOKUP(T11,loaders,2,0))","v":""},"WD",null,"Width:",{"$f":"IF(ISERROR(P17),\"\",P17)","v":""},null,{"$f":"VLOOKUP(T11,loaders,4,0)","v":{"$error":"#N/A"}},null,null,"John Deere",{"$f":"IF(S$26=\"AGCO\",AGCO!A6,IF(S$26=\"AGCO White\",'AGCO White'!A6,IF(S$26=\"AGCO Allis\",'AGCO Allis'!A6,IF(S$26=\"Buhler\",Buhler!A6,IF(S$26=\"Case IH\",Case!A6,IF(S$26=\"Challenger\",Challenger!A6,IF(S$26=\"Deutz\",Deutz!A6,IF(S$26=\"John Deere\",'John Deere'!A6,IF(S$26=\"Kubota\",Kubota!A6,IF(S$26=\"Landini\",Landini!A6,IF(S$26=\"Massey Ferguson\",MF!A6,IF(S$26=\"McCormick\",McCormick!A6,IF(S$26=\"New Holland\",NH!A6,IF(S$26=\"Kioti\",KIOTI!A6,IF(S$26=\"Mahindra\",MAHINDRA!A6,IF(S$26=\"Valtra\",Valtra!A6,IF(S$26=\"\",\"\",0)))))))))))))))))","v":""}]
[null,"Notes:",{"$f":"IF(ISERROR(Q14),\"\",Q14)","v":""},null,null,null,null,null,null,null,null,null,null,null,null,null,null,null,"Kioti",{"$f":"IF(S$26=\"AGCO\",AGCO!A7,IF(S$26=\"AGCO White\",'AGCO White'!A7,IF(S$26=\"AGCO Allis\",'AGCO Allis'!A7,IF(S$26=\"Buhler\",Buhler!A7,IF(S$26=\"Case IH\",Case!A7,IF(S$26=\"Challenger\",Challenger!A7,IF(S$26=\"Deutz\",Deutz!A7,IF(S$26=\"John Deere\",'John Deere'!A7,IF(S$26=\"Kubota\",Kubota!A7,IF(S$26=\"Landini\",Landini!A7,IF(S$26=\"Massey Ferguson\",MF!A7,IF(S$26=\"McCormick\",McCormick!A7,IF(S$26=\"New Holland\",NH!A7,IF(S$26=\"Kioti\",KIOTI!A7,IF(S$26=\"Mahindra\",MAHINDRA!A7,IF(S$26=\"Valtra\",Valtra!A7,IF(S$26=\"\",\"\",0)))))))))))))))))","v":""},null,"Quicke Grey",{"$f":"VLOOKUP(P19,Options!A1:C25,3,0)","v":{"$error":"#N/A"}},"Quicke Grey"]
[null,1,{"$f":"IF(ISERROR(W3),\"\",W3)","v":""},null,null,null,null,null,null,null,null,null,null,null,null,null,null,null,"Kubota",{"$f":"IF(S$26=\"AGCO\",AGCO!A8,IF(S$26=\"AGCO White\",'AGCO White'!A8,IF(S$26=\"AGCO Allis\",'AGCO Allis'!A8,IF(S$26=\"Buhler\",Buhler!A8,IF(S$26=\"Case IH\",Case!A8,IF(S$26=\"Challenger\",Challenger!A8,IF(S$26=\"Deutz\",Deutz!A8,IF(S$26=\"John Deere\",'John Deere'!A8,IF(S$26=\"Kubota\",Kubota!A8,IF(S$26=\"Landini\",Landini!A8,IF(S$26=\"Massey Ferguson\",MF!A8,IF(S$26=\"McCormick\",McCormick!A8,IF(S$26=\"New Holland\",NH!A8,IF(S$26=\"Kioti\",KIOTI!A8,IF(S$26=\"Mahindra\",MAHINDRA!A8,IF(S$26=\"Valtra\",Valtra!A8,IF(S$26=\"\",\"\",0)))))))))))))))))","v":""},null,{"$f":"IF(OR(Options!E$42=\"U\",Options!D$42=\"1\"),\"\",\"John Deere Green\")","v":{"$error":"#N/A"}},null,{"$f":"IF(ISERROR(V19),\"\",V19)","v":""}]
[null,2,{"$f":"IF(ISERROR(W4),\"\",W4)","v":""},null,null,null,null,null,null,null,null,null,null,null,null,{"$f":"IF(ISERROR(VLOOKUP(T$11,loaders,9,0)),\"\",VLOOKUP(T$11,loaders,9,0))","v":""},null,null,"Landini",{"$f":"IF(S$26=\"AGCO\",AGCO!A9,IF(S$26=\"AGCO White\",'AGCO White'!A9,IF(S$26=\"AGCO Allis\",'AGCO Allis'!A9,IF(S$26=\"Buhler\",Buhler!A9,IF(S$26=\"Case IH\",Case!A9,IF(S$26=\"Challenger\",Challenger!A9,IF(S$26=\"Deutz\",Deutz!A9,IF(S$26=\"John Deere\",'John Deere'!A9,IF(S$26=\"Kubota\",Kubota!A9,IF(S$26=\"Landini\",Landini!A9,IF(S$26=\"Massey Ferguson\",MF!A9,IF(S$26=\"McCormick\",McCormick!A9,IF(S$26=\"New Holland\",NH!A9,IF(S$26=\"Kioti\",KIOTI!A9,IF(S$26=\"Mahindra\",MAHINDRA!A9,IF(S$26=\"Valtra\",Valtra!A9,IF(S$26=\"\",\"\",0)))))))))))))))))","v":""},null,{"$f":"IF(OR(Options!E$42=\"U\",Options!D$42=\"1\"),\"\",\"Kubota Orange\")","v":{"$error":"#N/A"}},null,{"$f":"IF(ISERROR(V20),\"\",V20)","v":""}]
[null,3,{"$f":"IF(ISERROR(W5),\"\",W5)","v":""},null,null,null,null,null,null,null,null,null,null,null,null,{"$f":"IF(ISERROR(VLOOKUP(T$11,loaders,10,0)),\"\",VLOOKUP(T$11,loaders,10,0))","v":""},null,null,"Mahindra",{"$f":"IF(S$26=\"AGCO\",AGCO!A10,IF(S$26=\"AGCO White\",'AGCO White'!A10,IF(S$26=\"AGCO Allis\",'AGCO Allis'!A10,IF(S$26=\"Buhler\",Buhler!A10,IF(S$26=\"Case IH\",Case!A10,IF(S$26=\"Challenger\",Challenger!A10,IF(S$26=\"Deutz\",Deutz!A10,IF(S$26=\"John Deere\",'John Deere'!A10,IF(S$26=\"Kubota\",Kubota!A10,IF(S$26=\"Landini\",Landini!A10,IF(S$26=\"Massey Ferguson\",MF!A10,IF(S$26=\"McCormick\",McCormick!A10,IF(S$26=\"New Holland\",NH!A10,IF(S$26=\"Kioti\",KIOTI!A10,IF(S$26=\"Mahindra\",MAHINDRA!A10,IF(S$26=\"Valtra\",Valtra!A10,IF(S$26=\"\",\"\",0)))))))))))))))))","v":""},null,{"$f":"IF(OR(Options!E$42=\"U\",Options!D$42=\"1\"),\"\",\"Massey Ferguson Red\")","v":{"$error":"#N/A"}},null,""]
[null,4,{"$f":"IF(ISERROR(W6),\"\",W6)","v":""},null,null,null,null,null,null,null,null,null,null,null,null,{"$f":"IF(ISERROR(VLOOKUP(T$11,loaders,11,0)),\"\",VLOOKUP(T$11,loaders,11,0))","v":""},null,null,"Massey Ferguson",{"$f":"IF(S$26=\"AGCO\",AGCO!A11,IF(S$26=\"AGCO White\",'AGCO White'!A11,IF(S$26=\"AGCO Allis\",'AGCO Allis'!A11,IF(S$26=\"Buhler\",Buhler!A11,IF(S$26=\"Case IH\",Case!A11,IF(S$26=\"Challenger\",Challenger!A11,IF(S$26=\"Deutz\",Deutz!A11,IF(S$26=\"John Deere\",'John Deere'!A11,IF(S$26=\"Kubota\",Kubota!A11,IF(S$26=\"Landini\",Landini!A11,IF(S$26=\"Massey Ferguson\",MF!A11,IF(S$26=\"McCormick\",McCormick!A11,IF(S$26=\"New Holland\",NH!A11,IF(S$26=\"Kioti\",KIOTI!A11,IF(S$26=\"Mahindra\",MAHINDRA!A11,IF(S$26=\"Valtra\",Valtra!A11,IF(S$26=\"\",\"\",0)))))))))))))))))","v":""},null,{"$f":"IF(OR(Options!E$42=\"U\",Options!D$42=\"1\"),\"\",\"New Holland Blue\")","v":{"$error":"#N/A"}},null,"",null,null,null,null,null,null,{"$f":"VLOOKUP(AD22,Prices!B:E,4,0)","v":{"$error":"#N/A"}}]
[null,null,null,null,null,null,null,null,null,null,null,null,null,null,null,{"$f":"IF(ISERROR(VLOOKUP(T$11,loaders,12,0)),\"\",VLOOKUP(T$11,loaders,12,0))","v":""},null,null,"McCormick",{"$f":"IF(S$26=\"AGCO\",AGCO!A12,IF(S$26=\"AGCO White\",'AGCO White'!A12,IF(S$26=\"AGCO Allis\",'AGCO Allis'!A12,IF(S$26=\"Buhler\",Buhler!A12,IF(S$26=\"Case IH\",Case!A12,IF(S$26=\"Challenger\",Challenger!A12,IF(S$26=\"Deutz\",Deutz!A12,IF(S$26=\"John Deere\",'John Deere'!A12,IF(S$26=\"Kubota\",Kubota!A12,IF(S$26=\"Landini\",Landini!A12,IF(S$26=\"Massey Ferguson\",MF!A12,IF(S$26=\"McCormick\",McCormick!A12,IF(S$26=\"New Holland\",NH!A12,IF(S$26=\"Kioti\",KIOTI!A12,IF(S$26=\"Mahindra\",MAHINDRA!A12,IF(S$26=\"Valtra\",Valtra!A12,IF(S$26=\"\",\"\",0)))))))))))))))))","v":""},null,{"$f":"IF(OR(Options!E$42=\"U\",Options!D$42=\"1\"),\"\",\"Case IH Red\")","v":{"$error":"#N/A"}},null,""]
[null,null,null,null,null,null,null,null,"Loader Code:",null,{"$f":"Options!L33","v":""},null,null,null,null,{"$f":"IF(ISERROR(VLOOKUP(T$11,loaders,13,0)),\"\",VLOOKUP(T$11,loaders,13,0))","v":""},null,null,"New Holland",{"$f":"IF(S$26=\"AGCO\",AGCO!A13,IF(S$26=\"AGCO White\",'AGCO White'!A13,IF(S$26=\"AGCO Allis\",'AGCO Allis'!A13,IF(S$26=\"Buhler\",Buhler!A13,IF(S$26=\"Case IH\",Case!A13,IF(S$26=\"Challenger\",Challenger!A13,IF(S$26=\"Deutz\",Deutz!A13,IF(S$26=\"John Deere\",'John Deere'!A13,IF(S$26=\"Kubota\",Kubota!A13,IF(S$26=\"Landini\",Landini!A13,IF(S$26=\"Massey Ferguson\",MF!A13,IF(S$26=\"McCormick\",McCormick!A13,IF(S$26=\"New Holland\",NH!A13,IF(S$26=\"Kioti\",KIOTI!A13,IF(S$26=\"Mahindra\",MAHINDRA!A13,IF(S$26=\"Valtra\",Valtra!A13,IF(S$26=\"\",\"\",0)))))))))))))))))","v":""},null,{"$f":"IF(OR(Options!E$42=\"U\",Options!D$42=\"1\"),\"\",\"Deutz Green\")","v":{"$error":"#N/A"}},null,""]
[null,"Select Loader:",null,null,null,null,null,null,null,null,null,"List Price",null,null,null,{"$f":"IF(ISERROR(VLOOKUP(T$11,loaders,14,0)),\"\",VLOOKUP(T$11,loaders,14,0))","v":""},null,null,"Valtra",{"$f":"IF(S$26=\"AGCO\",AGCO!A14,IF(S$26=\"AGCO White\",'AGCO White'!A14,IF(S$26=\"AGCO Allis\",'AGCO Allis'!A14,IF(S$26=\"Buhler\",Buhler!A14,IF(S$26=\"Case IH\",Case!A14,IF(S$26=\"Challenger\",Challenger!A14,IF(S$26=\"Deutz\",Deutz!A14,IF(S$26=\"John Deere\",'John Deere'!A14,IF(S$26=\"Kubota\",Kubota!A14,IF(S$26=\"Landini\",Landini!A14,IF(S$26=\"Massey Ferguson\",MF!A14,IF(S$26=\"McCormick\",McCormick!A14,IF(S$26=\"New Holland\",NH!A14,IF(S$26=\"Kioti\",KIOTI!A14,IF(S$26=\"Mahindra\",MAHINDRA!A14,IF(S$26=\"Valtra\",Valtra!A14,IF(S$26=\"\",\"\",0)))))))))))))))))","v":""},null,null,null,null,null,{"$f":"IF(ISERROR(Options!B36),\"\",Options!B36)","v":""},null,null,null,{"$f":"IF(Q$12=\"Skid Steer\",VLOOKUP(P$19,Buckets!A$27:F$51,2,0),IF(Q12=\"Euro\",VLOOKUP(P$19,Buckets!A$2:K$24,2,0),IF(Q12=\"PIN ON\",VLOOKUP(P$19,Buckets!A$52:K$53,2,0),\"\")))","v":""},{"$f":"IF(ISERROR(VLOOKUP(AD25,vmaster,2,0)),\"\",VLOOKUP(AD25,vmaster,2,0))","v":""},null,null,null,"USD","CAD"]
[null,"Loader Color:",null,null,null,null,null,null,null,null,null,{"$f":"IF($M$48=\"USD\",AI26,AJ26)","v":""},null,null,null,{"$f":"IF(ISERROR(VLOOKUP(T$11,loaders,15,0)),\"\",VLOOKUP(T$11,loaders,15,0))","v":""},null,null,null,{"$f":"IF(S$26=\"AGCO\",AGCO!A15,IF(S$26=\"AGCO White\",'AGCO White'!A15,IF(S$26=\"AGCO Allis\",'AGCO Allis'!A15,IF(S$26=\"Buhler\",Buhler!A15,IF(S$26=\"Case IH\",Case!A15,IF(S$26=\"Challenger\",Challenger!A15,IF(S$26=\"Deutz\",Deutz!A15,IF(S$26=\"John Deere\",'John Deere'!A15,IF(S$26=\"Kubota\",Kubota!A15,IF(S$26=\"Landini\",Landini!A15,IF(S$26=\"Massey Ferguson\",MF!A15,IF(S$26=\"McCormick\",McCormick!A15,IF(S$26=\"New Holland\",NH!A15,IF(S$26=\"Kioti\",KIOTI!A15,IF(S$26=\"Mahindra\",MAHINDRA!A15,IF(S$26=\"Valtra\",Valtra!A15,IF(S$26=\"\",\"\",0)))))))))))))))))","v":""},null,null,null,{"$f":"IF(Q48=\"3 Function Hose Kit\",\"3 Function Diverter Valve\",IF(Q48=\"2 Function Hose Kit\",\"3 Function Diverter Valve\",\"3 Function Diverter Valve\"))","v":"3 Function Diverter Valve"},{"$f":"VLOOKUP(P19,Options!A1:I25,9,0)","v":{"$error":"#N/A"}},null,{"$f":"VLOOKUP(T11,loaders,26,0)","v":{"$error":"#N/A"}},{"$f":"IF(AA26=1,\"5034021\",\"\")","v":{"$error":"#N/A"}},null,{"$f":"IF(Q12=\"Skid Steer\",VLOOKUP(P$19,Buckets!A$27:F$51,3,0),IF(Q12=\"Euro\",VLOOKUP(P$19,Buckets!A$2:K$24,3,0),IF(Q12=\"PIN ON\",VLOOKUP(P$19,Buckets!A$52:K$53,3,0),\"\")))","v":""},"",null,null,null,{"$f":"IF($K$24=\"\",\"\",VLOOKUP(Options!$A$39,vmaster,3,0))","v":""},{"$f":"IF($K$24=\"\",\"\",VLOOKUP(Options!$A$39,vmaster,4,0))","v":""}]
[null,"Quick Attach:",null,null,null,null,null,null,null,null,null,null,null,null,null,{"$f":"IF(ISERROR(VLOOKUP(T$11,loaders,16,0)),\"\",VLOOKUP(T$11,loaders,16,0))","v":""},null,null,null,{"$f":"IF(S$26=\"AGCO\",AGCO!A16,IF(S$26=\"AGCO White\",'AGCO White'!A16,IF(S$26=\"AGCO Allis\",'AGCO Allis'!A16,IF(S$26=\"Buhler\",Buhler!A16,IF(S$26=\"Case IH\",Case!A16,IF(S$26=\"Challenger\",Challenger!A16,IF(S$26=\"Deutz\",Deutz!A16,IF(S$26=\"John Deere\",'John Deere'!A16,IF(S$26=\"Kubota\",Kubota!A16,IF(S$26=\"Landini\",Landini!A16,IF(S$26=\"Massey Ferguson\",MF!A16,IF(S$26=\"McCormick\",McCormick!A16,IF(S$26=\"New Holland\",NH!A16,IF(S$26=\"Kioti\",KIOTI!A16,IF(S$26=\"Mahindra\",MAHINDRA!A16,IF(S$26=\"Valtra\",Valtra!A16,IF(S$26=\"\",\"\",0)))))))))))))))))","v":""},null,null,null,{"$f":"IF(Z25=\"XA\",\"\",IF(Q48=\"2 Function Hose Kit\",\"\",IF(Q48=\"3 Function Hose Kit\",\"\",IF(AA26=1,\"\",\"Live 3rd Function\"))))","v":{"$error":"#N/A"}},null,null,null,null,null,{"$f":"IF(Q12=\"Skid Steer\",VLOOKUP(P$19,Buckets!A$27:F$51,4,0),IF(Q12=\"Euro\",VLOOKUP(P$19,Buckets!A$2:K$24,4,0),IF(Q12=\"PIN ON\",VLOOKUP(P$19,Buckets!A$52:K$53,4,0),\"\")))","v":""},""]
[null,"Subframe:",null,null,null,null,null,null,null,{"$f":"IF(R32=\"\",\"\",R28)","v":""},null,{"$f":"IF($M$48=\"USD\",AI28,AJ28)","v":""},null,null,null,{"$f":"IF(M48=\"USD\",AI28,AJ28)","v":""},null,{"$f":"VLOOKUP(T11,loaders,17,0)","v":{"$error":"#N/A"}},null,{"$f":"IF(S$26=\"AGCO\",AGCO!A17,IF(S$26=\"AGCO White\",'AGCO White'!A17,IF(S$26=\"AGCO Allis\",'AGCO Allis'!A17,IF(S$26=\"Buhler\",Buhler!A17,IF(S$26=\"Case IH\",Case!A17,IF(S$26=\"Challenger\",Challenger!A17,IF(S$26=\"Deutz\",Deutz!A17,IF(S$26=\"John Deere\",'John Deere'!A17,IF(S$26=\"Kubota\",Kubota!A17,IF(S$26=\"Landini\",Landini!A17,IF(S$26=\"Massey Ferguson\",MF!A17,IF(S$26=\"McCormick\",McCormick!A17,IF(S$26=\"New Holland\",NH!A17,IF(S$26=\"Kioti\",KIOTI!A17,IF(S$26=\"Mahindra\",MAHINDRA!A17,IF(S$26=\"Valtra\",Valtra!A17,IF(S$26=\"\",\"\",0)))))))))))))))))","v":""},"Yes",null,null,null,null,null,null,null,null,{"$f":"IF(Q12=\"Skid Steer\",VLOOKUP(P$19,Buckets!A$27:F$49,5,0),IF(Q12=\"Euro\",VLOOKUP(P$19,Buckets!A$2:K$24,5,0),IF(Q12=\"PIN ON\",VLOOKUP(P$19,Buckets!A$52:K$53,5,0),\"\")))","v":""},"",null,null,null,{"$f":"IF($J$28=\"\",\"\",VLOOKUP($J$28,vmaster,3,0))","v":""},{"$f":"IF($J$28=\"\",\"\",VLOOKUP($J$28,vmaster,4,0))","v":""}]
[null,"Hydraulics:",null,null,null,null,null,null,null,{"$f":"IF(ISERROR(Q49),\"\",Q49)","v":""},null,"",null,null,null,null,null,null,null,{"$f":"IF(S$26=\"AGCO\",AGCO!A18,IF(S$26=\"AGCO White\",'AGCO White'!A18,IF(S$26=\"AGCO Allis\",'AGCO Allis'!A18,IF(S$26=\"Buhler\",Buhler!A18,IF(S$26=\"Case IH\",Case!A18,IF(S$26=\"Challenger\",Challenger!A18,IF(S$26=\"Deutz\",Deutz!A18,IF(S$26=\"John Deere\",'John Deere'!A18,IF(S$26=\"Kubota\",Kubota!A18,IF(S$26=\"Landini\",Landini!A18,IF(S$26=\"Massey Ferguson\",MF!A18,IF(S$26=\"McCormick\",McCormick!A18,IF(S$26=\"New Holland\",NH!A18,IF(S$26=\"Kioti\",KIOTI!A18,IF(S$26=\"Mahindra\",MAHINDRA!A18,IF(S$26=\"Valtra\",Valtra!A18,IF(S$26=\"\",\"\",0)))))))))))))))))","v":""},"No",null,null,"2 Function Mechanical",5034284,null,null,null,null,{"$f":"IF(Q12=\"Skid Steer\",VLOOKUP(P$19,Buckets!A$27:F$49,6,0),IF(Q12=\"Euro\",VLOOKUP(P$19,Buckets!A$2:K$24,6,0),IF(Q12=\"PIN ON\",VLOOKUP(P$19,Buckets!A$52:K$53,6,0),\"\")))","v":""},"",null,null,null,{"$f":"IF(J29=\"\",\"\",VLOOKUP(J29,vmaster,3,0))","v":""},{"$f":"IF(J29=\"\",\"\",VLOOKUP(J29,vmaster,4,0))","v":""}]
[null,"Loader Options:",null,null,{"$f":"IF(P19=\"\",\"\",VLOOKUP(P19,Options!A1:N25,14,0))","v":""},null,null,null,null,null,null,null,null,null,null,null,null,{"$f":"VLOOKUP(R$28,vmaster,2,0)","v":{"$error":"#N/A"}},null,{"$f":"IF(S$26=\"AGCO\",AGCO!A19,IF(S$26=\"AGCO White\",'AGCO White'!A19,IF(S$26=\"AGCO Allis\",'AGCO Allis'!A19,IF(S$26=\"Buhler\",Buhler!A19,IF(S$26=\"Case IH\",Case!A19,IF(S$26=\"Challenger\",Challenger!A19,IF(S$26=\"Deutz\",Deutz!A19,IF(S$26=\"John Deere\",'John Deere'!A19,IF(S$26=\"Kubota\",Kubota!A19,IF(S$26=\"Landini\",Landini!A19,IF(S$26=\"Massey Ferguson\",MF!A19,IF(S$26=\"McCormick\",McCormick!A19,IF(S$26=\"New Holland\",NH!A19,IF(S$26=\"Kioti\",KIOTI!A19,IF(S$26=\"Mahindra\",MAHINDRA!A19,IF(S$26=\"Valtra\",Valtra!A19,IF(S$26=\"\",\"\",0)))))))))))))))))","v":""},null,null,null,"2 Function Electric",5034283,null,null,null,null,{"$f":"IF(Q12=\"Skid Steer\",VLOOKUP(P$19,Buckets!A$27:F$49,7,0),IF(Q12=\"Euro\",VLOOKUP(P$19,Buckets!A$2:K$24,7,0),IF(Q12=\"PIN ON\",VLOOKUP(P$19,Buckets!A$52:K$53,7,0),\"\")))","v":""},"",null,null,null,"",""]
[null,"Soft Drive:",null,null,null,null,null,null,null,{"$f":"IF(U26=\"YES\",VLOOKUP(Options!A39,Options!A1:G25,7,0),\"\")","v":""},null,{"$f":"IF($M$48=\"USD\",AI31,AJ31)","v":""},null,null,null,null,null,null,null,{"$f":"IF(S$26=\"AGCO\",AGCO!A20,IF(S$26=\"AGCO White\",'AGCO White'!A20,IF(S$26=\"AGCO Allis\",'AGCO Allis'!A20,IF(S$26=\"Buhler\",Buhler!A20,IF(S$26=\"Case IH\",Case!A20,IF(S$26=\"Challenger\",Challenger!A20,IF(S$26=\"Deutz\",Deutz!A20,IF(S$26=\"John Deere\",'John Deere'!A20,IF(S$26=\"Kubota\",Kubota!A20,IF(S$26=\"Landini\",Landini!A20,IF(S$26=\"Massey Ferguson\",MF!A20,IF(S$26=\"McCormick\",McCormick!A20,IF(S$26=\"New Holland\",NH!A20,IF(S$26=\"Kioti\",KIOTI!A20,IF(S$26=\"Mahindra\",MAHINDRA!A20,IF(S$26=\"Valtra\",Valtra!A20,IF(S$26=\"\",\"\",0)))))))))))))))))","v":""},null,null,null,null,null,null,null,null,null,{"$f":"IF(Q12=\"Skid Steer\",VLOOKUP(P$19,Buckets!A$27:F$49,8,0),IF(Q12=\"Euro\",VLOOKUP(P$19,Buckets!A$2:K$24,8,0),IF(Q12=\"PIN ON\",VLOOKUP(P$19,Buckets!A$52:K$53,8,0),\"\")))","v":""},"",null,null,null,"",""]
[null,"3rd Function:",null,null,null,null,null,null,null,{"$f":"Y32","v":""},null,{"$f":"IF($M$48=\"USD\",AI32,AJ32)","v":""},null,null,null,null,null,null,null,{"$f":"IF(S$26=\"AGCO\",AGCO!A21,IF(S$26=\"AGCO White\",'AGCO White'!A21,IF(S$26=\"AGCO Allis\",'AGCO Allis'!A21,IF(S$26=\"Buhler\",Buhler!A21,IF(S$26=\"Case IH\",Case!A21,IF(S$26=\"Challenger\",Challenger!A21,IF(S$26=\"Deutz\",Deutz!A21,IF(S$26=\"John Deere\",'John Deere'!A21,IF(S$26=\"Kubota\",Kubota!A21,IF(S$26=\"Landini\",Landini!A21,IF(S$26=\"Massey Ferguson\",MF!A21,IF(S$26=\"McCormick\",McCormick!A21,IF(S$26=\"New Holland\",NH!A21,IF(S$26=\"Kioti\",KIOTI!A21,IF(S$26=\"Mahindra\",MAHINDRA!A21,IF(S$26=\"Valtra\",Valtra!A21,IF(S$26=\"\",\"\",0)))))))))))))))))","v":""},{"$f":"IF(U26=\"Yes\",VLOOKUP(P19,Options!A1:G25,7),\"\")","v":""},null,null,{"$f":"IF(X28=\"3 Function Diverter Valve\",Y26,IF(X28=\"Live 3rd Function\",VLOOKUP(Q48,X29:Y30,2,0),\"\"))","v":""},{"$f":"IF(ISERROR(X32),\"\",X32)","v":""},null,null,null,null,{"$f":"IF(Q12=\"Skid Steer\",VLOOKUP(P$19,Buckets!A$27:F$49,9,0),IF(Q12=\"Euro\",VLOOKUP(P$19,Buckets!A$2:K$24,9,0),IF(Q12=\"PIN ON\",VLOOKUP(P$19,Buckets!A$52:K$53,9,0),\"\")))","v":""},"",null,null,null,"",""]
[null,null,null,null,null,{"$f":"IF(X28=\"Live 3rd Function\",\"Live 3rd Hose Kit\",IF(Q46=\"3 Function Hose Kit\",\"Live 3rd Hose Kit\",IF(Q48=1,\"Electric Handle Kit\",\"\")))","v":""},null,null,null,{"$f":"IF(F33=\"Live 3rd Hose Kit\",VLOOKUP(P19,Options!A1:J25,10,0),IF(F33=\"Electric Handle Kit\",\"5102162F\",\"\"))","v":""},null,"",null,null,null,null,null,null,null,{"$f":"IF(S$26=\"AGCO\",AGCO!A22,IF(S$26=\"AGCO White\",'AGCO White'!A22,IF(S$26=\"AGCO Allis\",'AGCO Allis'!A22,IF(S$26=\"Buhler\",Buhler!A22,IF(S$26=\"Case IH\",Case!A22,IF(S$26=\"Challenger\",Challenger!A22,IF(S$26=\"Deutz\",Deutz!A22,IF(S$26=\"John Deere\",'John Deere'!A22,IF(S$26=\"Kubota\",Kubota!A22,IF(S$26=\"Landini\",Landini!A22,IF(S$26=\"Massey Ferguson\",MF!A22,IF(S$26=\"McCormick\",McCormick!A22,IF(S$26=\"New Holland\",NH!A22,IF(S$26=\"Kioti\",KIOTI!A22,IF(S$26=\"Mahindra\",MAHINDRA!A22,IF(S$26=\"Valtra\",Valtra!A22,IF(S$26=\"\",\"\",0)))))))))))))))))","v":""},{"$f":"IF(U26=\"Yes\",VLOOKUP(P19,Options!A1:H25,8),\"\")","v":""},null,null,null,null,null,null,null,null,{"$f":"IF(Q20=\"Skid Steer\",VLOOKUP(P$19,Buckets!A$27:F$49,2,0),IF(Q20=\"Euro\",VLOOKUP(P$19,Buckets!A$2:K$24,2,0),IF(Q20=\"PIN ON\",VLOOKUP(P$19,Buckets!A$52:K$53,2,0),\"\")))","v":""},null,null,null,null,"",""]
[null,null,{"$f":"VLOOKUP(J34,Prices!A:B,2,0)","v":"-"},null,null,null,null,null,null,{"$f":"VLOOKUP(J28,'Loader Details'!Q:R,2,0)","v":0},null,0,null,null,null,null,"2 Function Mechanical",{"$f":"VLOOKUP(T11,'Loader Details'!A:AB,20,0)","v":{"$error":"#N/A"}},null,{"$f":"IF(S$26=\"AGCO\",AGCO!A23,IF(S$26=\"AGCO White\",'AGCO White'!A23,IF(S$26=\"AGCO Allis\",'AGCO Allis'!A23,IF(S$26=\"Buhler\",Buhler!A23,IF(S$26=\"Case IH\",Case!A23,IF(S$26=\"Challenger\",Challenger!A23,IF(S$26=\"Deutz\",Deutz!A23,IF(S$26=\"John Deere\",'John Deere'!A23,IF(S$26=\"Kubota\",Kubota!A23,IF(S$26=\"Landini\",Landini!A23,IF(S$26=\"Massey Ferguson\",MF!A23,IF(S$26=\"McCormick\",McCormick!A23,IF(S$26=\"New Holland\",NH!A23,IF(S$26=\"Kioti\",KIOTI!A23,IF(S$26=\"Mahindra\",MAHINDRA!A23,IF(S$26=\"Valtra\",Valtra!A23,IF(S$26=\"\",\"\",0)))))))))))))))))","v":""},{"$f":"IF(N17=\"US\",U33,U32)","v":""},null,null,null,null,null,null,null,null,{"$f":"IF(Q21=\"Skid Steer\",VLOOKUP(P$19,Buckets!A$27:F$49,2,0),IF(Q21=\"Euro\",VLOOKUP(P$19,Buckets!A$2:K$24,2,0),IF(Q21=\"PIN ON\",VLOOKUP(P$19,Buckets!A$52:K$53,2,0),\"\")))","v":""},null,null,null,null,0,0]
[null,null,null,null,null,null,null,null,null,null,null,null,null,null,null,null,"2 Function Hose Kit",{"$f":"VLOOKUP(T11,'Loader Details'!A:AB,22,0)","v":{"$error":"#N/A"}},null,{"$f":"IF(S$26=\"AGCO\",AGCO!A24,IF(S$26=\"AGCO White\",'AGCO White'!A24,IF(S$26=\"AGCO Allis\",'AGCO Allis'!A24,IF(S$26=\"Buhler\",Buhler!A24,IF(S$26=\"Case IH\",Case!A24,IF(S$26=\"Challenger\",Challenger!A24,IF(S$26=\"Deutz\",Deutz!A24,IF(S$26=\"John Deere\",'John Deere'!A24,IF(S$26=\"Kubota\",Kubota!A24,IF(S$26=\"Landini\",Landini!A24,IF(S$26=\"Massey Ferguson\",MF!A24,IF(S$26=\"McCormick\",McCormick!A24,IF(S$26=\"New Holland\",NH!A24,IF(S$26=\"Kioti\",KIOTI!A24,IF(S$26=\"Mahindra\",MAHINDRA!A24,IF(S$26=\"Valtra\",Valtra!A24,IF(S$26=\"\",\"\",0)))))))))))))))))","v":""},{"$f":"IF(N17=\"US\",U33,U32)","v":""},null,null,null,null,null,null,null,null,null,null,null,null,null,"",""]
[null,"Other:",null,null,null,{"$f":"IF(ISERROR(VLOOKUP(C36,vmaster,2,0)),\"\",VLOOKUP(C36,vmaster,2,0))","v":"-"},null,null,null,null,null,{"$f":"IF($M$48=\"USD\",AI36,AJ36)","v":""},null,null,null,null,"2 Function Electric",{"$f":"VLOOKUP(T11,'Loader Details'!A:AB,21,0)","v":{"$error":"#N/A"}},null,{"$f":"IF(S$26=\"AGCO\",AGCO!A25,IF(S$26=\"AGCO White\",'AGCO White'!A25,IF(S$26=\"AGCO Allis\",'AGCO Allis'!A25,IF(S$26=\"Buhler\",Buhler!A25,IF(S$26=\"Case IH\",Case!A25,IF(S$26=\"Challenger\",Challenger!A25,IF(S$26=\"Deutz\",Deutz!A25,IF(S$26=\"John Deere\",'John Deere'!A25,IF(S$26=\"Kubota\",Kubota!A25,IF(S$26=\"Landini\",Landini!A25,IF(S$26=\"Massey Ferguson\",MF!A25,IF(S$26=\"McCormick\",McCormick!A25,IF(S$26=\"New Holland\",NH!A25,IF(S$26=\"Kioti\",KIOTI!A25,IF(S$26=\"Mahindra\",MAHINDRA!A25,IF(S$26=\"Valtra\",Valtra!A25,IF(S$26=\"\",\"\",0)))))))))))))))))","v":""},null,null,null,null,null,null,null,null,null,null,null,null,null,null,{"$f":"IF(C36=\"\",\"\",VLOOKUP(C36,vmaster,3,0))","v":""},{"$f":"IF(C36=\"\",\"\",VLOOKUP(C36,vmaster,4,0))","v":""}]
[null,"Implements:",null,null,null,null,null,null,null,null,null,null,null,null,null,null,"3 Function Hose Kit",{"$f":"VLOOKUP(T11,'Loader Details'!A:AB,23,0)","v":{"$error":"#N/A"}},null,{"$f":"IF(S$26=\"AGCO\",AGCO!A26,IF(S$26=\"AGCO White\",'AGCO White'!A26,IF(S$26=\"AGCO Allis\",'AGCO Allis'!A26,IF(S$26=\"Buhler\",Buhler!A26,IF(S$26=\"Case IH\",Case!A26,IF(S$26=\"Challenger\",Challenger!A26,IF(S$26=\"Deutz\",Deutz!A26,IF(S$26=\"John Deere\",'John Deere'!A26,IF(S$26=\"Kubota\",Kubota!A26,IF(S$26=\"Landini\",Landini!A26,IF(S$26=\"Massey Ferguson\",MF!A26,IF(S$26=\"McCormick\",McCormick!A26,IF(S$26=\"New Holland\",NH!A26,IF(S$26=\"Kioti\",KIOTI!A26,IF(S$26=\"Mahindra\",MAHINDRA!A26,IF(S$26=\"Valtra\",Valtra!A26,IF(S$26=\"\",\"\",0)))))))))))))))))","v":""},null,null,null,null,null,null,null,null,null,null,null,null,null,null,{"$f":"IF(J37=\"\",\"\",VLOOKUP(J37,vmaster,3,0))","v":""},{"$f":"IF(J37=\"\",\"\",VLOOKUP(C37,vmaster,4,0))","v":""}]
[null,"Bucket:",null,null,null,null,null,null,null,{"$f":"IF(ISERROR(AE22),\"\",AE22)","v":""},null,{"$f":"IF($M$48=\"USD\",AI38,AJ38)","v":""},null,null,null,null,"Compact Loader Valve - Cab Tractors",{"$f":"VLOOKUP(T11,'Loader Details'!A:AB,27,0)","v":{"$error":"#N/A"}},null,{"$f":"IF(S$26=\"AGCO\",AGCO!A27,IF(S$26=\"AGCO White\",'AGCO White'!A27,IF(S$26=\"AGCO Allis\",'AGCO Allis'!A27,IF(S$26=\"Buhler\",Buhler!A27,IF(S$26=\"Case IH\",Case!A27,IF(S$26=\"Challenger\",Challenger!A27,IF(S$26=\"Deutz\",Deutz!A27,IF(S$26=\"John Deere\",'John Deere'!A27,IF(S$26=\"Kubota\",Kubota!A27,IF(S$26=\"Landini\",Landini!A27,IF(S$26=\"Massey Ferguson\",MF!A27,IF(S$26=\"McCormick\",McCormick!A27,IF(S$26=\"New Holland\",NH!A27,IF(S$26=\"Kioti\",KIOTI!A27,IF(S$26=\"Mahindra\",MAHINDRA!A27,IF(S$26=\"Valtra\",Valtra!A27,IF(S$26=\"\",\"\",0)))))))))))))))))","v":""},null,null,null,null,null,null,null,null,null,null,null,null,null,null,{"$f":"IF(J38=\"\",\"\",VLOOKUP(J38,vmaster,3,0))","v":""},{"$f":"IF(J38=\"\",\"\",VLOOKUP(J38,vmaster,4,0))","v":""}]
[null,"Implement:",null,null,null,null,null,null,null,{"$f":"IF(ISERROR(Q66),\"\",Q66)","v":""},null,{"$f":"IF($M$48=\"USD\",AI39,AJ39)","v":""},null,null,null,null,"Compact Loader Valve - Rops Tractors",{"$f":"VLOOKUP(T11,'Loader Details'!A:AB,28,0)","v":{"$error":"#N/A"}},null,{"$f":"IF(S$26=\"AGCO\",AGCO!A28,IF(S$26=\"AGCO White\",'AGCO White'!A28,IF(S$26=\"AGCO Allis\",'AGCO Allis'!A28,IF(S$26=\"Buhler\",Buhler!A28,IF(S$26=\"Case IH\",Case!A28,IF(S$26=\"Challenger\",Challenger!A28,IF(S$26=\"Deutz\",Deutz!A28,IF(S$26=\"John Deere\",'John Deere'!A28,IF(S$26=\"Kubota\",Kubota!A28,IF(S$26=\"Landini\",Landini!A28,IF(S$26=\"Massey Ferguson\",MF!A28,IF(S$26=\"McCormick\",McCormick!A28,IF(S$26=\"New Holland\",NH!A28,IF(S$26=\"Kioti\",KIOTI!A28,IF(S$26=\"Mahindra\",MAHINDRA!A28,IF(S$26=\"Valtra\",Valtra!A28,IF(S$26=\"\",\"\",0)))))))))))))))))","v":""},null,null,null,null,null,null,null,null,null,null,null,null,null,null,{"$f":"IF(J39=\"\",\"\",VLOOKUP(J39,vmaster,3,0))","v":""},{"$f":"IF(J39=\"\",\"\",VLOOKUP(J39,vmaster,4,0))","v":""}]
[null,{"$f":"IF(ISERROR(Q66),\"\",VLOOKUP(Q66,Implements!S6:T25,2,0))","v":""},null,null,null,null,null,null,null,null,null,null,null,null,null,null,{"$f":"IF(R34=\"\",\"\",\"2 Function Mechanical\")","v":{"$error":"#N/A"}},{"$f":"IF(ISERROR(Q40),\"\",Q40)","v":""},null,{"$f":"IF(S$26=\"AGCO\",AGCO!A29,IF(S$26=\"AGCO White\",'AGCO White'!A29,IF(S$26=\"AGCO Allis\",'AGCO Allis'!A29,IF(S$26=\"Buhler\",Buhler!A29,IF(S$26=\"Case IH\",Case!A29,IF(S$26=\"Challenger\",Challenger!A29,IF(S$26=\"Deutz\",Deutz!A29,IF(S$26=\"John Deere\",'John Deere'!A29,IF(S$26=\"Kubota\",Kubota!A29,IF(S$26=\"Landini\",Landini!A29,IF(S$26=\"Massey Ferguson\",MF!A29,IF(S$26=\"McCormick\",McCormick!A29,IF(S$26=\"New Holland\",NH!A29,IF(S$26=\"Kioti\",KIOTI!A29,IF(S$26=\"Mahindra\",MAHINDRA!A29,IF(S$26=\"Valtra\",Valtra!A29,IF(S$26=\"\",\"\",0)))))))))))))))))","v":""},null,null,null,null,null,null,null,null,null,null,null,null,null,null,{"$f":"IF(C41=\"\",\"\",VLOOKUP(C41,vmaster,3,0))","v":""},{"$f":"IF(C41=\"\",\"\",VLOOKUP(C41,vmaster,4,0))","v":""}]
[null,"Other:",null,null,null,{"$f":"IF(ISERROR(VLOOKUP(C41,vmaster,2,0)),\"\",VLOOKUP(C41,vmaster,2,0))","v":"-"},null,null,null,null,null,{"$f":"IF($M$48=\"USD\",AI40,AJ40)","v":""},null,null,null,null,{"$f":"IF(R35=\"\",\"\",\"2 Function Hose Kit\")","v":{"$error":"#N/A"}},{"$f":"IF(ISERROR(Q41),\"\",Q41)","v":""},null,{"$f":"IF(S$26=\"AGCO\",AGCO!A30,IF(S$26=\"AGCO White\",'AGCO White'!A30,IF(S$26=\"AGCO Allis\",'AGCO Allis'!A30,IF(S$26=\"Buhler\",Buhler!A30,IF(S$26=\"Case IH\",Case!A30,IF(S$26=\"Challenger\",Challenger!A30,IF(S$26=\"Deutz\",Deutz!A30,IF(S$26=\"John Deere\",'John Deere'!A30,IF(S$26=\"Kubota\",Kubota!A30,IF(S$26=\"Landini\",Landini!A30,IF(S$26=\"Massey Ferguson\",MF!A30,IF(S$26=\"McCormick\",McCormick!A30,IF(S$26=\"New Holland\",NH!A30,IF(S$26=\"Kioti\",KIOTI!A30,IF(S$26=\"Mahindra\",MAHINDRA!A30,IF(S$26=\"Valtra\",Valtra!A30,IF(S$26=\"\",\"\",0)))))))))))))))))","v":""}]
[null,null,null,null,null,null,null,null,null,null,null,null,null,null,null,null,{"$f":"IF(R36=\"\",\"\",\"2 Function Electric\")","v":{"$error":"#N/A"}},"",null,{"$f":"IF(S$26=\"AGCO\",AGCO!A31,IF(S$26=\"AGCO White\",'AGCO White'!A31,IF(S$26=\"AGCO Allis\",'AGCO Allis'!A31,IF(S$26=\"Buhler\",Buhler!A31,IF(S$26=\"Case IH\",Case!A31,IF(S$26=\"Challenger\",Challenger!A31,IF(S$26=\"Deutz\",Deutz!A31,IF(S$26=\"John Deere\",'John Deere'!A31,IF(S$26=\"Kubota\",Kubota!A31,IF(S$26=\"Landini\",Landini!A31,IF(S$26=\"Massey Ferguson\",MF!A31,IF(S$26=\"McCormick\",McCormick!A31,IF(S$26=\"New Holland\",NH!A31,IF(S$26=\"Kioti\",KIOTI!A31,IF(S$26=\"Mahindra\",MAHINDRA!A31,IF(S$26=\"Valtra\",Valtra!A31,IF(S$26=\"\",\"\",0)))))))))))))))))","v":""}]
[null,"Comments:",null,null,null,null,null,null,null,"List Price:",null,{"$f":"SUM(L26:O42)","v":0},null,null,null,null,{"$f":"IF(R37=\"\",\"\",\"3 Function Hose Kit\")","v":{"$error":"#N/A"}},"",null,{"$f":"IF(S$26=\"AGCO\",AGCO!A32,IF(S$26=\"AGCO White\",'AGCO White'!A32,IF(S$26=\"AGCO Allis\",'AGCO Allis'!A32,IF(S$26=\"Buhler\",Buhler!A32,IF(S$26=\"Case IH\",Case!A32,IF(S$26=\"Challenger\",Challenger!A32,IF(S$26=\"Deutz\",Deutz!A32,IF(S$26=\"John Deere\",'John Deere'!A32,IF(S$26=\"Kubota\",Kubota!A34,IF(S$26=\"Landini\",Landini!A32,IF(S$26=\"Massey Ferguson\",MF!A32,IF(S$26=\"McCormick\",McCormick!A32,IF(S$26=\"New Holland\",NH!A32,IF(S$26=\"Kioti\",KIOTI!A32,IF(S$26=\"Mahindra\",MAHINDRA!A32,IF(S$26=\"Valtra\",Valtra!A32,IF(S$26=\"\",\"\",0)))))))))))))))))","v":""}]
[null,null,null,null,null,null,null,null,null,null,null,null,null,null,null,null,{"$f":"IF(R38=\"\",\"\",\"Compact Loader Valve - Cab Tractors\")","v":{"$error":"#N/A"}},{"$f":"IF(ISERROR(Q44),\"\",Q44)","v":""},null,{"$f":"IF(S$26=\"AGCO\",AGCO!A33,IF(S$26=\"AGCO White\",'AGCO White'!A33,IF(S$26=\"AGCO Allis\",'AGCO Allis'!A33,IF(S$26=\"Buhler\",Buhler!A33,IF(S$26=\"Case IH\",Case!A33,IF(S$26=\"Challenger\",Challenger!A33,IF(S$26=\"Deutz\",Deutz!A33,IF(S$26=\"John Deere\",'John Deere'!A33,IF(S$26=\"Kubota\",Kubota!A35,IF(S$26=\"Landini\",Landini!A33,IF(S$26=\"Massey Ferguson\",MF!A33,IF(S$26=\"McCormick\",McCormick!A33,IF(S$26=\"New Holland\",NH!A33,IF(S$26=\"Kioti\",KIOTI!A33,IF(S$26=\"Mahindra\",MAHINDRA!A33,IF(S$26=\"Valtra\",Valtra!A33,IF(S$26=\"\",\"\",0)))))))))))))))))","v":""}]
[null,null,null,null,null,null,null,null,null,"Freight:",null,{"$f":"Options!M25","v":""},null,null,null,null,{"$f":"IF(R39=\"\",\"\",\"Compact Loader Valve - Rops Tractors\")","v":{"$error":"#N/A"}},"",null,{"$f":"IF(S$26=\"AGCO\",AGCO!A34,IF(S$26=\"AGCO White\",'AGCO White'!A34,IF(S$26=\"AGCO Allis\",'AGCO Allis'!A34,IF(S$26=\"Buhler\",Buhler!A34,IF(S$26=\"Case IH\",Case!A34,IF(S$26=\"Challenger\",Challenger!A34,IF(S$26=\"Deutz\",Deutz!A34,IF(S$26=\"John Deere\",'John Deere'!A34,IF(S$26=\"Kubota\",Kubota!A36,IF(S$26=\"Landini\",Landini!A34,IF(S$26=\"Massey Ferguson\",MF!A34,IF(S$26=\"McCormick\",McCormick!A34,IF(S$26=\"New Holland\",NH!A34,IF(S$26=\"Kioti\",KIOTI!A34,IF(S$26=\"Mahindra\",MAHINDRA!A34,IF(S$26=\"Valtra\",Valtra!A34,IF(S$26=\"\",\"\",0)))))))))))))))))","v":""}]
[null,null,null,null,null,null,null,null,null,null,null,null,null,null,null,null,{"$f":"IF(R40=\"\",\"\",\"Compact Loader Valve - Cab Tractors\")","v":""},{"$f":"IF(ISERROR(Q46),\"\",Q46)","v":""},null,{"$f":"IF(S$26=\"AGCO\",AGCO!A35,IF(S$26=\"AGCO White\",'AGCO White'!A35,IF(S$26=\"AGCO Allis\",'AGCO Allis'!A35,IF(S$26=\"Buhler\",Buhler!A35,IF(S$26=\"Case IH\",Case!A35,IF(S$26=\"Challenger\",Challenger!A35,IF(S$26=\"Deutz\",Deutz!A35,IF(S$26=\"John Deere\",'John Deere'!A35,IF(S$26=\"Kubota\",Kubota!A37,IF(S$26=\"Landini\",Landini!A35,IF(S$26=\"Massey Ferguson\",MF!A35,IF(S$26=\"McCormick\",McCormick!A35,IF(S$26=\"New Holland\",NH!A35,IF(S$26=\"Kioti\",KIOTI!A35,IF(S$26=\"Mahindra\",MAHINDRA!A35,IF(S$26=\"Valtra\",Valtra!A35,IF(S$26=\"\",\"\",0)))))))))))))))))","v":""},null,null,null,null,null,null,null,null,null,null,null,null,null,null,{"$f":"IF(J47=\"\",\"\",VLOOKUP(J47,vmaster,3,0))","v":{"$error":"#N/A"}},{"$f":"IF(J47=\"\",\"\",VLOOKUP(J47,vmaster,4,0))","v":{"$error":"#N/A"}}]
[null,null,null,null,null,null,null,null,null,"Expedited Rate:",null,{"$f":"Options!V25","v":""},null,null,null,null,{"$f":"IF(R41=\"\",\"\",\"Compact Loader Valve - Rops Tractors\")","v":""},"",null,{"$f":"IF(S$26=\"AGCO\",AGCO!A36,IF(S$26=\"AGCO White\",'AGCO White'!A36,IF(S$26=\"AGCO Allis\",'AGCO Allis'!A36,IF(S$26=\"Buhler\",Buhler!A36,IF(S$26=\"Case IH\",Case!A36,IF(S$26=\"Challenger\",Challenger!A36,IF(S$26=\"Deutz\",Deutz!A36,IF(S$26=\"John Deere\",'John Deere'!A36,IF(S$26=\"Kubota\",Kubota!A38,IF(S$26=\"Landini\",Landini!A36,IF(S$26=\"Massey Ferguson\",MF!A36,IF(S$26=\"McCormick\",McCormick!A36,IF(S$26=\"New Holland\",NH!A36,IF(S$26=\"Kioti\",KIOTI!A36,IF(S$26=\"Mahindra\",MAHINDRA!A36,IF(S$26=\"Valtra\",Valtra!A36,IF(S$26=\"\",\"\",0)))))))))))))))))","v":""},null,null,null,null,null,null,null,null,null,null,null,null,null,null,{"$error":"#N/A"},{"$error":"#N/A"}]
[null,null,null,null,null,null,null,null,null,"Prices in",null,null,"USD",null,null,null,null,{"$f":"IF(OR(Q50=1,Q51=1),1,\"\")","v":""},null,{"$f":"IF(S$26=\"AGCO\",AGCO!A37,IF(S$26=\"AGCO White\",'AGCO White'!A37,IF(S$26=\"AGCO Allis\",'AGCO Allis'!A37,IF(S$26=\"Buhler\",Buhler!A37,IF(S$26=\"Case IH\",Case!A37,IF(S$26=\"Challenger\",Challenger!A37,IF(S$26=\"Deutz\",Deutz!A37,IF(S$26=\"John Deere\",'John Deere'!A37,IF(S$26=\"Kubota\",Kubota!A39,IF(S$26=\"Landini\",Landini!A37,IF(S$26=\"Massey Ferguson\",MF!A37,IF(S$26=\"McCormick\",McCormick!A37,IF(S$26=\"New Holland\",NH!A37,IF(S$26=\"Kioti\",KIOTI!A37,IF(S$26=\"Mahindra\",MAHINDRA!A37,IF(S$26=\"Valtra\",Valtra!A37,IF(S$26=\"\",\"\",0)))))))))))))))))","v":""},null,null,null,null,null,null,null,null,null,null,null,null,null,null,"",""]
[null,"Expedited rate pertains to large loaders that cannot ship LTL. Loader will ship as soon as it becomes available.",null,null,null,null,null,null,null,null,null,null,null,null,null,null,{"$f":"VLOOKUP(Q48,Q34:R39,2,0)","v":{"$error":"#N/A"}},null,null,{"$f":"IF(S$26=\"AGCO\",AGCO!A38,IF(S$26=\"AGCO White\",'AGCO White'!A38,IF(S$26=\"AGCO Allis\",'AGCO Allis'!A38,IF(S$26=\"Buhler\",Buhler!A38,IF(S$26=\"Case IH\",Case!A38,IF(S$26=\"Challenger\",Challenger!A38,IF(S$26=\"Deutz\",Deutz!A38,IF(S$26=\"John Deere\",'John Deere'!A38,IF(S$26=\"Kubota\",Kubota!A40,IF(S$26=\"Landini\",Landini!A38,IF(S$26=\"Massey Ferguson\",MF!A38,IF(S$26=\"McCormick\",McCormick!A38,IF(S$26=\"New Holland\",NH!A38,IF(S$26=\"Kioti\",KIOTI!A38,IF(S$26=\"Mahindra\",MAHINDRA!A38,IF(S$26=\"Valtra\",Valtra!A38,IF(S$26=\"\",\"\",0)))))))))))))))))","v":""},null,null,null,null,null,null,null,null,null,null,null,null,null,null,"",""]
[null,null,null,null,null,null,null,null,null,null,null,null,null,null,null,null,{"$f":"IF(AND(Q48=\"2 Function Hose Kit\",X28=\"3 Function Diverter Valve\"),1,\"\")","v":""},null,null,{"$f":"IF(S$26=\"AGCO\",AGCO!A39,IF(S$26=\"AGCO White\",'AGCO White'!A39,IF(S$26=\"AGCO Allis\",'AGCO Allis'!A39,IF(S$26=\"Buhler\",Buhler!A39,IF(S$26=\"Case IH\",Case!A39,IF(S$26=\"Challenger\",Challenger!A39,IF(S$26=\"Deutz\",Deutz!A39,IF(S$26=\"John Deere\",'John Deere'!A39,IF(S$26=\"Kubota\",Kubota!A41,IF(S$26=\"Landini\",Landini!A39,IF(S$26=\"Massey Ferguson\",MF!A39,IF(S$26=\"McCormick\",McCormick!A39,IF(S$26=\"New Holland\",NH!A39,IF(S$26=\"Kioti\",KIOTI!A39,IF(S$26=\"Mahindra\",MAHINDRA!A39,IF(S$26=\"Valtra\",Valtra!A39,IF(S$26=\"\",\"\",0)))))))))))))))))","v":""},null,null,null,null,null,null,null,null,null,null,null,null,null,null,"",""]
[null,null,null,null,null,null,null,null,null,null,null,null,null,null,null,null,null,null,null,{"$f":"IF(S$26=\"AGCO\",AGCO!A40,IF(S$26=\"AGCO White\",'AGCO White'!A40,IF(S$26=\"AGCO Allis\",'AGCO Allis'!A40,IF(S$26=\"Buhler\",Buhler!A40,IF(S$26=\"Case IH\",Case!A40,IF(S$26=\"Challenger\",Challenger!A40,IF(S$26=\"Deutz\",Deutz!A40,IF(S$26=\"John Deere\",'John Deere'!A40,IF(S$26=\"Kubota\",Kubota!A42,IF(S$26=\"Landini\",Landini!A40,IF(S$26=\"Massey Ferguson\",MF!A40,IF(S$26=\"McCormick\",McCormick!A40,IF(S$26=\"New Holland\",NH!A40,IF(S$26=\"Kioti\",KIOTI!A40,IF(S$26=\"Mahindra\",MAHINDRA!A40,IF(S$26=\"Valtra\",Valtra!A40,IF(S$26=\"\",\"\",0)))))))))))))))))","v":""},null,null,null,null,null,null,null,null,null,null,null,null,null,null,"",""]
[null,null,null,null,null,null,null,null,null,null,null,null,null,null,null,null,null,null,null,{"$f":"IF(S$26=\"AGCO\",AGCO!A41,IF(S$26=\"AGCO White\",'AGCO White'!A41,IF(S$26=\"AGCO Allis\",'AGCO Allis'!A41,IF(S$26=\"Buhler\",Buhler!A41,IF(S$26=\"Case IH\",Case!A41,IF(S$26=\"Challenger\",Challenger!A41,IF(S$26=\"Deutz\",Deutz!A41,IF(S$26=\"John Deere\",'John Deere'!A41,IF(S$26=\"Kubota\",Kubota!A43,IF(S$26=\"Landini\",Landini!A41,IF(S$26=\"Massey Ferguson\",MF!A41,IF(S$26=\"McCormick\",McCormick!A41,IF(S$26=\"New Holland\",NH!A41,IF(S$26=\"Kioti\",KIOTI!A41,IF(S$26=\"Mahindra\",MAHINDRA!A41,IF(S$26=\"Valtra\",Valtra!A41,IF(S$26=\"\",\"\",0)))))))))))))))))","v":""}]
[null,null,null,null,null,null,null,null,null,null,null,null,null,null,null,null,{"$f":"IF(Q$12=\"Euro\",VLOOKUP(P$19,Implements!A$2:O$24,2,0),IF(Q$12=\"Skid Steer\",VLOOKUP(P$19,Implements!A$27:O$49,2,0),\"\"))","v":""},{"$f":"IF(ISERROR(VLOOKUP(Q53,vmaster,2,0)),\"\",VLOOKUP(Q53,vmaster,2,0))","v":""},null,{"$f":"IF(S$26=\"AGCO\",AGCO!A42,IF(S$26=\"AGCO White\",'AGCO White'!A42,IF(S$26=\"AGCO Allis\",'AGCO Allis'!A42,IF(S$26=\"Buhler\",Buhler!A42,IF(S$26=\"Case IH\",Case!A42,IF(S$26=\"Challenger\",Challenger!A42,IF(S$26=\"Deutz\",Deutz!A42,IF(S$26=\"John Deere\",'John Deere'!A42,IF(S$26=\"Kubota\",Kubota!A44,IF(S$26=\"Landini\",Landini!A42,IF(S$26=\"Massey Ferguson\",MF!A42,IF(S$26=\"McCormick\",McCormick!A42,IF(S$26=\"New Holland\",NH!A42,IF(S$26=\"Kioti\",KIOTI!A42,IF(S$26=\"Mahindra\",MAHINDRA!A42,IF(S$26=\"Valtra\",Valtra!A42,IF(S$26=\"\",\"\",0)))))))))))))))))","v":""},null,null,null,{"$f":"Options!K32","v":{"$error":"#N/A"}},{"$f":"VLOOKUP(X53,Prices!A:C,3,FALSE)","v":{"$error":"#N/A"}}]
[null,null,null,null,null,null,null,null,null,null,null,null,null,null,null,null,{"$f":"IF(Q$12=\"Euro\",VLOOKUP(P$19,Implements!A$2:O$24,3,0),IF(Q$12=\"Skid Steer\",VLOOKUP(P$19,Implements!A$27:O$49,3,0),\"\"))","v":""},"",null,{"$f":"IF(S$26=\"AGCO\",AGCO!A43,IF(S$26=\"AGCO White\",'AGCO White'!A43,IF(S$26=\"AGCO Allis\",'AGCO Allis'!A43,IF(S$26=\"Buhler\",Buhler!A43,IF(S$26=\"Case IH\",Case!A43,IF(S$26=\"Challenger\",Challenger!A43,IF(S$26=\"Deutz\",Deutz!A43,IF(S$26=\"John Deere\",'John Deere'!A43,IF(S$26=\"Kubota\",Kubota!A45,IF(S$26=\"Landini\",Landini!A43,IF(S$26=\"Massey Ferguson\",MF!A43,IF(S$26=\"McCormick\",McCormick!A43,IF(S$26=\"New Holland\",NH!A43,IF(S$26=\"Kioti\",KIOTI!A43,IF(S$26=\"Mahindra\",MAHINDRA!A43,IF(S$26=\"Valtra\",Valtra!A43,IF(S$26=\"\",\"\",0)))))))))))))))))","v":""}]
[null,null,null,null,null,null,null,null,null,null,null,null,null,null,null,null,{"$f":"IF(Q$12=\"Euro\",VLOOKUP(P$19,Implements!A$2:O$24,4,0),IF(Q$12=\"Skid Steer\",VLOOKUP(P$19,Implements!A$27:O$49,4,0),\"\"))","v":""},"",null,{"$f":"IF(S$26=\"AGCO\",AGCO!A44,IF(S$26=\"AGCO White\",'AGCO White'!A44,IF(S$26=\"AGCO Allis\",'AGCO Allis'!A44,IF(S$26=\"Buhler\",Buhler!A44,IF(S$26=\"Case IH\",Case!A44,IF(S$26=\"Challenger\",Challenger!A44,IF(S$26=\"Deutz\",Deutz!A44,IF(S$26=\"John Deere\",'John Deere'!A44,IF(S$26=\"Kubota\",Kubota!A46,IF(S$26=\"Landini\",Landini!A44,IF(S$26=\"Massey Ferguson\",MF!A44,IF(S$26=\"McCormick\",McCormick!A44,IF(S$26=\"New Holland\",NH!A44,IF(S$26=\"Kioti\",KIOTI!A44,IF(S$26=\"Mahindra\",MAHINDRA!A44,IF(S$26=\"Valtra\",Valtra!A44,IF(S$26=\"\",\"\",0)))))))))))))))))","v":""}]
[null,null,null,null,null,null,null,null,null,null,null,null,null,null,null,null,{"$f":"IF(Q$12=\"Euro\",VLOOKUP(P$19,Implements!A$2:O$24,5,0),IF(Q$12=\"Skid Steer\",VLOOKUP(P$19,Implements!A$27:O$49,5,0),\"\"))","v":""},"",null,{"$f":"IF(S$26=\"AGCO\",AGCO!A45,IF(S$26=\"AGCO White\",'AGCO White'!A45,IF(S$26=\"AGCO Allis\",'AGCO Allis'!A45,IF(S$26=\"Buhler\",Buhler!A45,IF(S$26=\"Case IH\",Case!A45,IF(S$26=\"Challenger\",Challenger!A45,IF(S$26=\"Deutz\",Deutz!A45,IF(S$26=\"John Deere\",'John Deere'!A45,IF(S$26=\"Kubota\",Kubota!A47,IF(S$26=\"Landini\",Landini!A45,IF(S$26=\"Massey Ferguson\",MF!A45,IF(S$26=\"McCormick\",McCormick!A45,IF(S$26=\"New Holland\",NH!A45,IF(S$26=\"Kioti\",KIOTI!A45,IF(S$26=\"Mahindra\",MAHINDRA!A45,IF(S$26=\"Valtra\",Valtra!A45,IF(S$26=\"\",\"\",0)))))))))))))))))","v":""}]
[null,null,null,null,null,null,null,null,null,null,null,null,null,null,null,null,{"$f":"IF(Q$12=\"Euro\",VLOOKUP(P$19,Implements!A$2:O$24,6,0),IF(Q$12=\"Skid Steer\",VLOOKUP(P$19,Implements!A$27:O$49,6,0),\"\"))","v":""},"",null,{"$f":"IF(S$26=\"AGCO\",AGCO!A46,IF(S$26=\"AGCO White\",'AGCO White'!A46,IF(S$26=\"AGCO Allis\",'AGCO Allis'!A46,IF(S$26=\"Buhler\",Buhler!A46,IF(S$26=\"Case IH\",Case!A46,IF(S$26=\"Challenger\",Challenger!A46,IF(S$26=\"Deutz\",Deutz!A46,IF(S$26=\"John Deere\",'John Deere'!A46,IF(S$26=\"Kubota\",Kubota!A48,IF(S$26=\"Landini\",Landini!A46,IF(S$26=\"Massey Ferguson\",MF!A46,IF(S$26=\"McCormick\",McCormick!A46,IF(S$26=\"New Holland\",NH!A46,IF(S$26=\"Kioti\",KIOTI!A46,IF(S$26=\"Mahindra\",MAHINDRA!A46,IF(S$26=\"Valtra\",Valtra!A46,IF(S$26=\"\",\"\",0)))))))))))))))))","v":""}]
[null,null,null,null,null,null,null,null,null,null,null,null,null,null,null,null,{"$f":"IF(Q$12=\"Euro\",VLOOKUP(P$19,Implements!A$2:O$24,7,0),IF(Q$12=\"Skid Steer\",VLOOKUP(P$19,Implements!A$27:O$49,7,0),\"\"))","v":""},"",null,{"$f":"IF(S$26=\"AGCO\",AGCO!A47,IF(S$26=\"AGCO White\",'AGCO White'!A47,IF(S$26=\"AGCO Allis\",'AGCO Allis'!A47,IF(S$26=\"Buhler\",Buhler!A47,IF(S$26=\"Case IH\",Case!A47,IF(S$26=\"Challenger\",Challenger!A47,IF(S$26=\"Deutz\",Deutz!A47,IF(S$26=\"John Deere\",'John Deere'!A47,IF(S$26=\"Kubota\",Kubota!A49,IF(S$26=\"Landini\",Landini!A47,IF(S$26=\"Massey Ferguson\",MF!A47,IF(S$26=\"McCormick\",McCormick!A47,IF(S$26=\"New Holland\",NH!A47,IF(S$26=\"Kioti\",KIOTI!A47,IF(S$26=\"Mahindra\",MAHINDRA!A47,IF(S$26=\"Valtra\",Valtra!A47,IF(S$26=\"\",\"\",0)))))))))))))))))","v":""}]
[null,null,null,null,null,null,null,null,null,null,null,null,null,null,null,null,{"$f":"IF(Q$12=\"Euro\",VLOOKUP(P$19,Implements!A$2:O$24,8,0),IF(Q$12=\"Skid Steer\",VLOOKUP(P$19,Implements!A$27:O$49,8,0),\"\"))","v":""},"",null,{"$f":"IF(S$26=\"AGCO\",AGCO!A48,IF(S$26=\"AGCO White\",'AGCO White'!A48,IF(S$26=\"AGCO Allis\",'AGCO Allis'!A48,IF(S$26=\"Buhler\",Buhler!A48,IF(S$26=\"Case IH\",Case!A48,IF(S$26=\"Challenger\",Challenger!A48,IF(S$26=\"Deutz\",Deutz!A48,IF(S$26=\"John Deere\",'John Deere'!A48,IF(S$26=\"Kubota\",Kubota!A50,IF(S$26=\"Landini\",Landini!A48,IF(S$26=\"Massey Ferguson\",MF!A48,IF(S$26=\"McCormick\",McCormick!A48,IF(S$26=\"New Holland\",NH!A48,IF(S$26=\"Kioti\",KIOTI!A48,IF(S$26=\"Mahindra\",MAHINDRA!A48,IF(S$26=\"Valtra\",Valtra!A48,IF(S$26=\"\",\"\",0)))))))))))))))))","v":""}]
[null,null,null,null,null,null,null,null,null,null,null,null,null,null,null,null,{"$f":"IF(Q$12=\"Euro\",VLOOKUP(P$19,Implements!A$2:O$24,9,0),IF(Q$12=\"Skid Steer\",VLOOKUP(P$19,Implements!A$27:O$49,9,0),\"\"))","v":""},"",null,{"$f":"IF(S$26=\"AGCO\",AGCO!A49,IF(S$26=\"AGCO White\",'AGCO White'!A49,IF(S$26=\"AGCO Allis\",'AGCO Allis'!A49,IF(S$26=\"Buhler\",Buhler!A49,IF(S$26=\"Case IH\",Case!A49,IF(S$26=\"Challenger\",Challenger!A49,IF(S$26=\"Deutz\",Deutz!A49,IF(S$26=\"John Deere\",'John Deere'!A49,IF(S$26=\"Kubota\",Kubota!A51,IF(S$26=\"Landini\",Landini!A49,IF(S$26=\"Massey Ferguson\",MF!A49,IF(S$26=\"McCormick\",McCormick!A49,IF(S$26=\"New Holland\",NH!A49,IF(S$26=\"Kioti\",KIOTI!A49,IF(S$26=\"Mahindra\",MAHINDRA!A49,IF(S$26=\"Valtra\",Valtra!A49,IF(S$26=\"\",\"\",0)))))))))))))))))","v":""}]
[null,null,null,null,null,null,null,null,null,null,null,null,null,null,null,null,{"$f":"IF(Q$12=\"Euro\",VLOOKUP(P$19,Implements!A$2:O$24,10,0),IF(Q$12=\"Skid Steer\",VLOOKUP(P$19,Implements!A$27:O$49,10,0),\"\"))","v":""},"",null,{"$f":"IF(S$26=\"AGCO\",AGCO!A50,IF(S$26=\"AGCO White\",'AGCO White'!A50,IF(S$26=\"AGCO Allis\",'AGCO Allis'!A50,IF(S$26=\"Buhler\",Buhler!A50,IF(S$26=\"Case IH\",Case!A50,IF(S$26=\"Challenger\",Challenger!A50,IF(S$26=\"Deutz\",Deutz!A50,IF(S$26=\"John Deere\",'John Deere'!A50,IF(S$26=\"Kubota\",Kubota!A52,IF(S$26=\"Landini\",Landini!A50,IF(S$26=\"Massey Ferguson\",MF!A50,IF(S$26=\"McCormick\",McCormick!A50,IF(S$26=\"New Holland\",NH!A50,IF(S$26=\"Kioti\",KIOTI!A50,IF(S$26=\"Mahindra\",MAHINDRA!A50,IF(S$26=\"Valtra\",Valtra!A50,IF(S$26=\"\",\"\",0)))))))))))))))))","v":""}]
[null,null,null,null,null,null,null,null,null,null,null,null,null,null,null,null,{"$f":"IF(Q$12=\"Euro\",VLOOKUP(P$19,Implements!A$2:O$24,11,0),IF(Q$12=\"Skid Steer\",VLOOKUP(P$19,Implements!A$27:O$49,11,0),\"\"))","v":""},"",null,{"$f":"IF(S$26=\"AGCO\",AGCO!A51,IF(S$26=\"AGCO White\",'AGCO White'!A51,IF(S$26=\"AGCO Allis\",'AGCO Allis'!A51,IF(S$26=\"Buhler\",Buhler!A51,IF(S$26=\"Case IH\",Case!A51,IF(S$26=\"Challenger\",Challenger!A51,IF(S$26=\"Deutz\",Deutz!A51,IF(S$26=\"John Deere\",'John Deere'!A51,IF(S$26=\"Kubota\",Kubota!A53,IF(S$26=\"Landini\",Landini!A51,IF(S$26=\"Massey Ferguson\",MF!A51,IF(S$26=\"McCormick\",McCormick!A51,IF(S$26=\"New Holland\",NH!A51,IF(S$26=\"Kioti\",KIOTI!A51,IF(S$26=\"Mahindra\",MAHINDRA!A51,IF(S$26=\"Valtra\",Valtra!A51,IF(S$26=\"\",\"\",0)))))))))))))))))","v":""}]
[null,null,null,null,null,null,null,null,null,null,null,null,null,null,null,null,{"$f":"IF(Q$12=\"Euro\",VLOOKUP(P$19,Implements!A$2:O$24,12,0),IF(Q$12=\"Skid Steer\",VLOOKUP(P$19,Implements!A$27:O$49,12,0),\"\"))","v":""},"",null,{"$f":"IF(S$26=\"AGCO\",AGCO!A52,IF(S$26=\"AGCO White\",'AGCO White'!A52,IF(S$26=\"AGCO Allis\",'AGCO Allis'!A52,IF(S$26=\"Buhler\",Buhler!A52,IF(S$26=\"Case IH\",Case!A52,IF(S$26=\"Challenger\",Challenger!A52,IF(S$26=\"Deutz\",Deutz!A52,IF(S$26=\"John Deere\",'John Deere'!A52,IF(S$26=\"Kubota\",Kubota!A54,IF(S$26=\"Landini\",Landini!A52,IF(S$26=\"Massey Ferguson\",MF!A52,IF(S$26=\"McCormick\",McCormick!A52,IF(S$26=\"New Holland\",NH!A52,IF(S$26=\"Kioti\",KIOTI!A52,IF(S$26=\"Mahindra\",MAHINDRA!A52,IF(S$26=\"Valtra\",Valtra!A52,IF(S$26=\"\",\"\",0)))))))))))))))))","v":""}]
[null,null,null,null,null,null,null,null,null,null,null,null,null,null,null,null,{"$f":"IF(Q$12=\"Euro\",VLOOKUP(P$19,Implements!A$2:O$24,13,0),IF(Q$12=\"Skid Steer\",VLOOKUP(P$19,Implements!A$27:O$49,13,0),\"\"))","v":""},"",null,{"$f":"IF(S$26=\"AGCO\",AGCO!A53,IF(S$26=\"AGCO White\",'AGCO White'!A53,IF(S$26=\"AGCO Allis\",'AGCO Allis'!A53,IF(S$26=\"Buhler\",Buhler!A53,IF(S$26=\"Case IH\",Case!A53,IF(S$26=\"Challenger\",Challenger!A53,IF(S$26=\"Deutz\",Deutz!A53,IF(S$26=\"John Deere\",'John Deere'!A53,IF(S$26=\"Kubota\",Kubota!A55,IF(S$26=\"Landini\",Landini!A53,IF(S$26=\"Massey Ferguson\",MF!A53,IF(S$26=\"McCormick\",McCormick!A53,IF(S$26=\"New Holland\",NH!A53,IF(S$26=\"Kioti\",KIOTI!A53,IF(S$26=\"Mahindra\",MAHINDRA!A53,IF(S$26=\"Valtra\",Valtra!A53,IF(S$26=\"\",\"\",0)))))))))))))))))","v":""}]
[null,null,null,null,null,null,null,null,null,null,null,null,null,null,null,null,null,null,null,{"$f":"IF(S$26=\"AGCO\",AGCO!A54,IF(S$26=\"AGCO White\",'AGCO White'!A54,IF(S$26=\"AGCO Allis\",'AGCO Allis'!A54,IF(S$26=\"Buhler\",Buhler!A54,IF(S$26=\"Case IH\",Case!A54,IF(S$26=\"Challenger\",Challenger!A54,IF(S$26=\"Deutz\",Deutz!A54,IF(S$26=\"John Deere\",'John Deere'!A54,IF(S$26=\"Kubota\",Kubota!A56,IF(S$26=\"Landini\",Landini!A54,IF(S$26=\"Massey Ferguson\",MF!A54,IF(S$26=\"McCormick\",McCormick!A54,IF(S$26=\"New Holland\",NH!A54,IF(S$26=\"Kioti\",KIOTI!A54,IF(S$26=\"Mahindra\",MAHINDRA!A54,IF(S$26=\"Valtra\",Valtra!A54,IF(S$26=\"\",\"\",0)))))))))))))))))","v":""}]
[null,null,null,null,null,null,null,null,null,null,null,null,null,null,null,null,{"$f":"VLOOKUP(R50,Prices!B:E,4,0)","v":{"$error":"#N/A"}},null,null,{"$f":"IF(S$26=\"AGCO\",AGCO!A55,IF(S$26=\"AGCO White\",'AGCO White'!A55,IF(S$26=\"AGCO Allis\",'AGCO Allis'!A55,IF(S$26=\"Buhler\",Buhler!A55,IF(S$26=\"Case IH\",Case!A55,IF(S$26=\"Challenger\",Challenger!A55,IF(S$26=\"Deutz\",Deutz!A55,IF(S$26=\"John Deere\",'John Deere'!A55,IF(S$26=\"Kubota\",Kubota!A57,IF(S$26=\"Landini\",Landini!A55,IF(S$26=\"Massey Ferguson\",MF!A55,IF(S$26=\"McCormick\",McCormick!A55,IF(S$26=\"New Holland\",NH!A55,IF(S$26=\"Kioti\",KIOTI!A55,IF(S$26=\"Mahindra\",MAHINDRA!A55,IF(S$26=\"Valtra\",Valtra!A55,IF(S$26=\"\",\"\",0)))))))))))))))))","v":""}]
[null,null,null,null,null,null,null,null,null,null,null,null,null,null,null,null,null,null,null,{"$f":"IF(S$26=\"AGCO\",AGCO!A56,IF(S$26=\"AGCO White\",'AGCO White'!A56,IF(S$26=\"AGCO Allis\",'AGCO Allis'!A56,IF(S$26=\"Buhler\",Buhler!A56,IF(S$26=\"Case IH\",Case!A56,IF(S$26=\"Challenger\",Challenger!A56,IF(S$26=\"Deutz\",Deutz!A56,IF(S$26=\"John Deere\",'John Deere'!A56,IF(S$26=\"Kubota\",Kubota!A58,IF(S$26=\"Landini\",Landini!A56,IF(S$26=\"Massey Ferguson\",MF!A56,IF(S$26=\"McCormick\",McCormick!A56,IF(S$26=\"New Holland\",NH!A56,IF(S$26=\"Kioti\",KIOTI!A56,IF(S$26=\"Mahindra\",MAHINDRA!A56,IF(S$26=\"Valtra\",Valtra!A56,IF(S$26=\"\",\"\",0)))))))))))))))))","v":""}]
[null,null,null,null,null,null,null,null,null,null,null,null,null,null,null,null,null,null,null,{"$f":"IF(S$26=\"AGCO\",AGCO!A57,IF(S$26=\"AGCO White\",'AGCO White'!A57,IF(S$26=\"AGCO Allis\",'AGCO Allis'!A57,IF(S$26=\"Buhler\",Buhler!A57,IF(S$26=\"Case IH\",Case!A57,IF(S$26=\"Challenger\",Challenger!A57,IF(S$26=\"Deutz\",Deutz!A57,IF(S$26=\"John Deere\",'John Deere'!A57,IF(S$26=\"Kubota\",Kubota!A59,IF(S$26=\"Landini\",Landini!A57,IF(S$26=\"Massey Ferguson\",MF!A57,IF(S$26=\"McCormick\",McCormick!A57,IF(S$26=\"New Holland\",NH!A57,IF(S$26=\"Kioti\",KIOTI!A57,IF(S$26=\"Mahindra\",MAHINDRA!A57,IF(S$26=\"Valtra\",Valtra!A57,IF(S$26=\"\",\"\",0)))))))))))))))))","v":""}]
[null,null,null,null,null,null,null,null,null,null,null,null,null,null,null,null,null,null,null,{"$f":"IF(S$26=\"AGCO\",AGCO!A58,IF(S$26=\"AGCO White\",'AGCO White'!A58,IF(S$26=\"AGCO Allis\",'AGCO Allis'!A58,IF(S$26=\"Buhler\",Buhler!A58,IF(S$26=\"Case IH\",Case!A58,IF(S$26=\"Challenger\",Challenger!A58,IF(S$26=\"Deutz\",Deutz!A58,IF(S$26=\"John Deere\",'John Deere'!A58,IF(S$26=\"Kubota\",Kubota!A60,IF(S$26=\"Landini\",Landini!A58,IF(S$26=\"Massey Ferguson\",MF!A58,IF(S$26=\"McCormick\",McCormick!A58,IF(S$26=\"New Holland\",NH!A58,IF(S$26=\"Kioti\",KIOTI!A58,IF(S$26=\"Mahindra\",MAHINDRA!A58,IF(S$26=\"Valtra\",Valtra!A58,IF(S$26=\"\",\"\",0)))))))))))))))))","v":""}]
[null,null,null,null,null,null,null,null,null,null,null,null,null,null,null,null,null,null,null,{"$f":"IF(S$26=\"AGCO\",AGCO!A59,IF(S$26=\"AGCO White\",'AGCO White'!A59,IF(S$26=\"AGCO Allis\",'AGCO Allis'!A59,IF(S$26=\"Buhler\",Buhler!A59,IF(S$26=\"Case IH\",Case!A59,IF(S$26=\"Challenger\",Challenger!A59,IF(S$26=\"Deutz\",Deutz!A59,IF(S$26=\"John Deere\",'John Deere'!A59,IF(S$26=\"Kubota\",Kubota!A61,IF(S$26=\"Landini\",Landini!A59,IF(S$26=\"Massey Ferguson\",MF!A59,IF(S$26=\"McCormick\",McCormick!A59,IF(S$26=\"New Holland\",NH!A59,IF(S$26=\"Kioti\",KIOTI!A59,IF(S$26=\"Mahindra\",MAHINDRA!A59,IF(S$26=\"Valtra\",Valtra!A59,IF(S$26=\"\",\"\",0)))))))))))))))))","v":""}]
[null,null,null,null,null,null,null,null,null,null,null,null,null,null,null,null,null,null,null,{"$f":"IF(S$26=\"AGCO\",AGCO!A60,IF(S$26=\"AGCO White\",'AGCO White'!A60,IF(S$26=\"AGCO Allis\",'AGCO Allis'!A60,IF(S$26=\"Buhler\",Buhler!A60,IF(S$26=\"Case IH\",Case!A60,IF(S$26=\"Challenger\",Challenger!A60,IF(S$26=\"Deutz\",Deutz!A60,IF(S$26=\"John Deere\",'John Deere'!A60,IF(S$26=\"Kubota\",Kubota!A62,IF(S$26=\"Landini\",Landini!A60,IF(S$26=\"Massey Ferguson\",MF!A60,IF(S$26=\"McCormick\",McCormick!A60,IF(S$26=\"New Holland\",NH!A60,IF(S$26=\"Kioti\",KIOTI!A60,IF(S$26=\"Mahindra\",MAHINDRA!A60,IF(S$26=\"Valtra\",Valtra!A60,IF(S$26=\"\",\"\",0)))))))))))))))))","v":""}]
[null,null,null,null,null,null,null,null,null,null,null,null,null,null,null,null,null,null,null,{"$f":"IF(S$26=\"AGCO\",AGCO!A61,IF(S$26=\"AGCO White\",'AGCO White'!A61,IF(S$26=\"AGCO Allis\",'AGCO Allis'!A61,IF(S$26=\"Buhler\",Buhler!A61,IF(S$26=\"Case IH\",Case!A61,IF(S$26=\"Challenger\",Challenger!A61,IF(S$26=\"Deutz\",Deutz!A61,IF(S$26=\"John Deere\",'John Deere'!A61,IF(S$26=\"Kubota\",Kubota!A63,IF(S$26=\"Landini\",Landini!A61,IF(S$26=\"Massey Ferguson\",MF!A61,IF(S$26=\"McCormick\",McCormick!A61,IF(S$26=\"New Holland\",NH!A61,IF(S$26=\"Kioti\",KIOTI!A61,IF(S$26=\"Mahindra\",MAHINDRA!A61,IF(S$26=\"Valtra\",Valtra!A61,IF(S$26=\"\",\"\",0)))))))))))))))))","v":""}]
[null,null,null,null,null,null,null,null,null,null,null,null,null,null,null,null,null,null,null,{"$f":"IF(S$26=\"AGCO\",AGCO!A62,IF(S$26=\"AGCO White\",'AGCO White'!A62,IF(S$26=\"AGCO Allis\",'AGCO Allis'!A62,IF(S$26=\"Buhler\",Buhler!A62,IF(S$26=\"Case IH\",Case!A62,IF(S$26=\"Challenger\",Challenger!A62,IF(S$26=\"Deutz\",Deutz!A62,IF(S$26=\"John Deere\",'John Deere'!A62,IF(S$26=\"Kubota\",Kubota!A64,IF(S$26=\"Landini\",Landini!A62,IF(S$26=\"Massey Ferguson\",MF!A62,IF(S$26=\"McCormick\",McCormick!A62,IF(S$26=\"New Holland\",NH!A62,IF(S$26=\"Kioti\",KIOTI!A62,IF(S$26=\"Mahindra\",MAHINDRA!A62,IF(S$26=\"Valtra\",Valtra!A62,IF(S$26=\"\",\"\",0)))))))))))))))))","v":""}]
[null,null,null,null,null,null,null,null,null,null,null,null,null,null,null,null,null,null,null,{"$f":"IF(S$26=\"AGCO\",AGCO!A63,IF(S$26=\"AGCO White\",'AGCO White'!A63,IF(S$26=\"AGCO Allis\",'AGCO Allis'!A63,IF(S$26=\"Buhler\",Buhler!A63,IF(S$26=\"Case IH\",Case!A63,IF(S$26=\"Challenger\",Challenger!A63,IF(S$26=\"Deutz\",Deutz!A63,IF(S$26=\"John Deere\",'John Deere'!A63,IF(S$26=\"Kubota\",Kubota!A65,IF(S$26=\"Landini\",Landini!A63,IF(S$26=\"Massey Ferguson\",MF!A63,IF(S$26=\"McCormick\",McCormick!A63,IF(S$26=\"New Holland\",NH!A63,IF(S$26=\"Kioti\",KIOTI!A63,IF(S$26=\"Mahindra\",MAHINDRA!A63,IF(S$26=\"Valtra\",Valtra!A63,IF(S$26=\"\",\"\",0)))))))))))))))))","v":""}]
[null,null,null,null,null,null,null,null,null,null,null,null,null,null,null,null,null,null,null,{"$f":"IF(S$26=\"AGCO\",AGCO!A64,IF(S$26=\"AGCO White\",'AGCO White'!A64,IF(S$26=\"AGCO Allis\",'AGCO Allis'!A64,IF(S$26=\"Buhler\",Buhler!A64,IF(S$26=\"Case IH\",Case!A64,IF(S$26=\"Challenger\",Challenger!A64,IF(S$26=\"Deutz\",Deutz!A64,IF(S$26=\"John Deere\",'John Deere'!A64,IF(S$26=\"Kubota\",Kubota!A66,IF(S$26=\"Landini\",Landini!A64,IF(S$26=\"Massey Ferguson\",MF!A64,IF(S$26=\"McCormick\",McCormick!A64,IF(S$26=\"New Holland\",NH!A64,IF(S$26=\"Kioti\",KIOTI!A64,IF(S$26=\"Mahindra\",MAHINDRA!A64,IF(S$26=\"Valtra\",Valtra!A64,IF(S$26=\"\",\"\",0)))))))))))))))))","v":""}]
[null,null,null,null,null,null,null,null,null,null,null,null,null,null,null,null,null,null,null,{"$f":"IF(S$26=\"AGCO\",AGCO!A65,IF(S$26=\"AGCO White\",'AGCO White'!A65,IF(S$26=\"AGCO Allis\",'AGCO Allis'!A65,IF(S$26=\"Buhler\",Buhler!A65,IF(S$26=\"Case IH\",Case!A65,IF(S$26=\"Challenger\",Challenger!A65,IF(S$26=\"Deutz\",Deutz!A65,IF(S$26=\"John Deere\",'John Deere'!A65,IF(S$26=\"Kubota\",Kubota!A67,IF(S$26=\"Landini\",Landini!A65,IF(S$26=\"Massey Ferguson\",MF!A65,IF(S$26=\"McCormick\",McCormick!A65,IF(S$26=\"New Holland\",NH!A65,IF(S$26=\"Kioti\",KIOTI!A65,IF(S$26=\"Mahindra\",MAHINDRA!A65,IF(S$26=\"Valtra\",Valtra!A65,IF(S$26=\"\",\"\",0)))))))))))))))))","v":""}]
[null,null,null,null,null,null,null,null,null,null,null,null,null,null,null,null,null,null,null,{"$f":"IF(S$26=\"AGCO\",AGCO!A66,IF(S$26=\"AGCO White\",'AGCO White'!A66,IF(S$26=\"AGCO Allis\",'AGCO Allis'!A66,IF(S$26=\"Buhler\",Buhler!A66,IF(S$26=\"Case IH\",Case!A66,IF(S$26=\"Challenger\",Challenger!A66,IF(S$26=\"Deutz\",Deutz!A66,IF(S$26=\"John Deere\",'John Deere'!A66,IF(S$26=\"Kubota\",Kubota!A68,IF(S$26=\"Landini\",Landini!A66,IF(S$26=\"Massey Ferguson\",MF!A66,IF(S$26=\"McCormick\",McCormick!A66,IF(S$26=\"New Holland\",NH!A66,IF(S$26=\"Kioti\",KIOTI!A66,IF(S$26=\"Mahindra\",MAHINDRA!A66,IF(S$26=\"Valtra\",Valtra!A66,IF(S$26=\"\",\"\",0)))))))))))))))))","v":""}]
[null,null,null,null,null,null,null,null,null,null,null,null,null,null,null,null,null,null,null,{"$f":"IF(S$26=\"AGCO\",AGCO!A67,IF(S$26=\"AGCO White\",'AGCO White'!A67,IF(S$26=\"AGCO Allis\",'AGCO Allis'!A67,IF(S$26=\"Buhler\",Buhler!A67,IF(S$26=\"Case IH\",Case!A67,IF(S$26=\"Challenger\",Challenger!A67,IF(S$26=\"Deutz\",Deutz!A67,IF(S$26=\"John Deere\",'John Deere'!A67,IF(S$26=\"Kubota\",Kubota!A69,IF(S$26=\"Landini\",Landini!A67,IF(S$26=\"Massey Ferguson\",MF!A67,IF(S$26=\"McCormick\",McCormick!A67,IF(S$26=\"New Holland\",NH!A67,IF(S$26=\"Kioti\",KIOTI!A67,IF(S$26=\"Mahindra\",MAHINDRA!A67,IF(S$26=\"Valtra\",Valtra!A67,IF(S$26=\"\",\"\",0)))))))))))))))))","v":""}]
[null,null,null,null,null,null,null,null,null,null,null,null,null,null,null,null,null,null,null,{"$f":"IF(S$26=\"AGCO\",AGCO!A68,IF(S$26=\"AGCO White\",'AGCO White'!A68,IF(S$26=\"AGCO Allis\",'AGCO Allis'!A68,IF(S$26=\"Buhler\",Buhler!A68,IF(S$26=\"Case IH\",Case!A68,IF(S$26=\"Challenger\",Challenger!A68,IF(S$26=\"Deutz\",Deutz!A68,IF(S$26=\"John Deere\",'John Deere'!A68,IF(S$26=\"Kubota\",Kubota!A70,IF(S$26=\"Landini\",Landini!A68,IF(S$26=\"Massey Ferguson\",MF!A68,IF(S$26=\"McCormick\",McCormick!A68,IF(S$26=\"New Holland\",NH!A68,IF(S$26=\"Kioti\",KIOTI!A68,IF(S$26=\"Mahindra\",MAHINDRA!A68,IF(S$26=\"Valtra\",Valtra!A68,IF(S$26=\"\",\"\",0)))))))))))))))))","v":""}]
[null,null,null,null,null,null,null,null,null,null,null,null,null,null,null,null,null,null,null,{"$f":"IF(S$26=\"AGCO\",AGCO!A69,IF(S$26=\"AGCO White\",'AGCO White'!A69,IF(S$26=\"AGCO Allis\",'AGCO Allis'!A69,IF(S$26=\"Buhler\",Buhler!A69,IF(S$26=\"Case IH\",Case!A69,IF(S$26=\"Challenger\",Challenger!A69,IF(S$26=\"Deutz\",Deutz!A69,IF(S$26=\"John Deere\",'John Deere'!A69,IF(S$26=\"Kubota\",Kubota!A71,IF(S$26=\"Landini\",Landini!A69,IF(S$26=\"Massey Ferguson\",MF!A69,IF(S$26=\"McCormick\",McCormick!A69,IF(S$26=\"New Holland\",NH!A69,IF(S$26=\"Kioti\",KIOTI!A69,IF(S$26=\"Mahindra\",MAHINDRA!A69,IF(S$26=\"Valtra\",Valtra!A69,IF(S$26=\"\",\"\",0)))))))))))))))))","v":""}]
[null,null,null,null,null,null,null,null,null,null,null,null,null,null,null,null,null,null,null,{"$f":"IF(S$26=\"AGCO\",AGCO!A70,IF(S$26=\"AGCO White\",'AGCO White'!A70,IF(S$26=\"AGCO Allis\",'AGCO Allis'!A70,IF(S$26=\"Buhler\",Buhler!A70,IF(S$26=\"Case IH\",Case!A70,IF(S$26=\"Challenger\",Challenger!A70,IF(S$26=\"Deutz\",Deutz!A70,IF(S$26=\"John Deere\",'John Deere'!A70,IF(S$26=\"Kubota\",Kubota!A72,IF(S$26=\"Landini\",Landini!A70,IF(S$26=\"Massey Ferguson\",MF!A70,IF(S$26=\"McCormick\",McCormick!A70,IF(S$26=\"New Holland\",NH!A70,IF(S$26=\"Kioti\",KIOTI!A70,IF(S$26=\"Mahindra\",MAHINDRA!A70,IF(S$26=\"Valtra\",Valtra!A70,IF(S$26=\"\",\"\",0)))))))))))))))))","v":""}]
[null,null,null,null,null,null,null,null,null,null,null,null,null,null,null,null,null,null,null,{"$f":"IF(S$26=\"AGCO\",AGCO!A71,IF(S$26=\"AGCO White\",'AGCO White'!A71,IF(S$26=\"AGCO Allis\",'AGCO Allis'!A71,IF(S$26=\"Buhler\",Buhler!A71,IF(S$26=\"Case IH\",Case!A71,IF(S$26=\"Challenger\",Challenger!A71,IF(S$26=\"Deutz\",Deutz!A71,IF(S$26=\"John Deere\",'John Deere'!A71,IF(S$26=\"Kubota\",Kubota!A73,IF(S$26=\"Landini\",Landini!A71,IF(S$26=\"Massey Ferguson\",MF!A71,IF(S$26=\"McCormick\",McCormick!A71,IF(S$26=\"New Holland\",NH!A71,IF(S$26=\"Kioti\",KIOTI!A71,IF(S$26=\"Mahindra\",MAHINDRA!A71,IF(S$26=\"Valtra\",Valtra!A71,IF(S$26=\"\",\"\",0)))))))))))))))))","v":""}]
[null,null,null,null,null,null,null,null,null,null,null,null,null,null,null,null,null,null,null,{"$f":"IF(S$26=\"AGCO\",AGCO!A72,IF(S$26=\"AGCO White\",'AGCO White'!A72,IF(S$26=\"AGCO Allis\",'AGCO Allis'!A72,IF(S$26=\"Buhler\",Buhler!A72,IF(S$26=\"Case IH\",Case!A72,IF(S$26=\"Challenger\",Challenger!A72,IF(S$26=\"Deutz\",Deutz!A72,IF(S$26=\"John Deere\",'John Deere'!A72,IF(S$26=\"Kubota\",Kubota!A74,IF(S$26=\"Landini\",Landini!A72,IF(S$26=\"Massey Ferguson\",MF!A72,IF(S$26=\"McCormick\",McCormick!A72,IF(S$26=\"New Holland\",NH!A72,IF(S$26=\"Kioti\",KIOTI!A72,IF(S$26=\"Mahindra\",MAHINDRA!A72,IF(S$26=\"Valtra\",Valtra!A72,IF(S$26=\"\",\"\",0)))))))))))))))))","v":""}]
[null,null,null,null,null,null,null,null,null,null,null,null,null,null,null,null,null,null,null,{"$f":"IF(S$26=\"AGCO\",AGCO!A73,IF(S$26=\"AGCO White\",'AGCO White'!A73,IF(S$26=\"AGCO Allis\",'AGCO Allis'!A73,IF(S$26=\"Buhler\",Buhler!A73,IF(S$26=\"Case IH\",Case!A73,IF(S$26=\"Challenger\",Challenger!A73,IF(S$26=\"Deutz\",Deutz!A73,IF(S$26=\"John Deere\",'John Deere'!A73,IF(S$26=\"Kubota\",Kubota!A75,IF(S$26=\"Landini\",Landini!A73,IF(S$26=\"Massey Ferguson\",MF!A73,IF(S$26=\"McCormick\",McCormick!A73,IF(S$26=\"New Holland\",NH!A73,IF(S$26=\"Kioti\",KIOTI!A73,IF(S$26=\"Mahindra\",MAHINDRA!A73,IF(S$26=\"Valtra\",Valtra!A73,IF(S$26=\"\",\"\",0)))))))))))))))))","v":""}]
[null,null,null,null,null,null,null,null,null,null,null,null,null,null,null,null,null,null,null,{"$f":"IF(S$26=\"AGCO\",AGCO!A74,IF(S$26=\"AGCO White\",'AGCO White'!A74,IF(S$26=\"AGCO Allis\",'AGCO Allis'!A74,IF(S$26=\"Buhler\",Buhler!A74,IF(S$26=\"Case IH\",Case!A74,IF(S$26=\"Challenger\",Challenger!A74,IF(S$26=\"Deutz\",Deutz!A74,IF(S$26=\"John Deere\",'John Deere'!A74,IF(S$26=\"Kubota\",Kubota!A76,IF(S$26=\"Landini\",Landini!A74,IF(S$26=\"Massey Ferguson\",MF!A74,IF(S$26=\"McCormick\",McCormick!A74,IF(S$26=\"New Holland\",NH!A74,IF(S$26=\"Kioti\",KIOTI!A74,IF(S$26=\"Mahindra\",MAHINDRA!A74,IF(S$26=\"Valtra\",Valtra!A74,IF(S$26=\"\",\"\",0)))))))))))))))))","v":""}]
[null,null,null,null,null,null,null,null,null,null,null,null,null,null,null,null,null,null,null,{"$f":"IF(S$26=\"AGCO\",AGCO!A75,IF(S$26=\"AGCO White\",'AGCO White'!A75,IF(S$26=\"AGCO Allis\",'AGCO Allis'!A75,IF(S$26=\"Buhler\",Buhler!A75,IF(S$26=\"Case IH\",Case!A75,IF(S$26=\"Challenger\",Challenger!A75,IF(S$26=\"Deutz\",Deutz!A75,IF(S$26=\"John Deere\",'John Deere'!A75,IF(S$26=\"Kubota\",Kubota!A77,IF(S$26=\"Landini\",Landini!A75,IF(S$26=\"Massey Ferguson\",MF!A75,IF(S$26=\"McCormick\",McCormick!A75,IF(S$26=\"New Holland\",NH!A75,IF(S$26=\"Kioti\",KIOTI!A75,IF(S$26=\"Mahindra\",MAHINDRA!A75,IF(S$26=\"Valtra\",Valtra!A75,IF(S$26=\"\",\"\",0)))))))))))))))))","v":""}]
[null,null,null,null,null,null,null,null,null,null,null,null,null,null,null,null,null,null,null,{"$f":"IF(S$26=\"AGCO\",AGCO!A76,IF(S$26=\"AGCO White\",'AGCO White'!A76,IF(S$26=\"AGCO Allis\",'AGCO Allis'!A76,IF(S$26=\"Buhler\",Buhler!A76,IF(S$26=\"Case IH\",Case!A76,IF(S$26=\"Challenger\",Challenger!A76,IF(S$26=\"Deutz\",Deutz!A76,IF(S$26=\"John Deere\",'John Deere'!A76,IF(S$26=\"Kubota\",Kubota!A78,IF(S$26=\"Landini\",Landini!A76,IF(S$26=\"Massey Ferguson\",MF!A76,IF(S$26=\"McCormick\",McCormick!A76,IF(S$26=\"New Holland\",NH!A76,IF(S$26=\"Kioti\",KIOTI!A76,IF(S$26=\"Mahindra\",MAHINDRA!A76,IF(S$26=\"Valtra\",Valtra!A76,IF(S$26=\"\",\"\",0)))))))))))))))))","v":""}]
[null,null,null,null,null,null,null,null,null,null,null,null,null,null,null,null,null,null,null,{"$f":"IF(S$26=\"AGCO\",AGCO!A77,IF(S$26=\"AGCO White\",'AGCO White'!A77,IF(S$26=\"AGCO Allis\",'AGCO Allis'!A77,IF(S$26=\"Buhler\",Buhler!A77,IF(S$26=\"Case IH\",Case!A77,IF(S$26=\"Challenger\",Challenger!A77,IF(S$26=\"Deutz\",Deutz!A77,IF(S$26=\"John Deere\",'John Deere'!A77,IF(S$26=\"Kubota\",Kubota!A79,IF(S$26=\"Landini\",Landini!A77,IF(S$26=\"Massey Ferguson\",MF!A77,IF(S$26=\"McCormick\",McCormick!A77,IF(S$26=\"New Holland\",NH!A77,IF(S$26=\"Kioti\",KIOTI!A77,IF(S$26=\"Mahindra\",MAHINDRA!A77,IF(S$26=\"Valtra\",Valtra!A77,IF(S$26=\"\",\"\",0)))))))))))))))))","v":""}]
[null,null,null,null,null,null,null,null,null,null,null,null,null,null,null,null,null,null,null,{"$f":"IF(S$26=\"AGCO\",AGCO!A78,IF(S$26=\"AGCO White\",'AGCO White'!A78,IF(S$26=\"AGCO Allis\",'AGCO Allis'!A78,IF(S$26=\"Buhler\",Buhler!A78,IF(S$26=\"Case IH\",Case!A78,IF(S$26=\"Challenger\",Challenger!A78,IF(S$26=\"Deutz\",Deutz!A78,IF(S$26=\"John Deere\",'John Deere'!A78,IF(S$26=\"Kubota\",Kubota!A80,IF(S$26=\"Landini\",Landini!A78,IF(S$26=\"Massey Ferguson\",MF!A78,IF(S$26=\"McCormick\",McCormick!A78,IF(S$26=\"New Holland\",NH!A78,IF(S$26=\"Kioti\",KIOTI!A78,IF(S$26=\"Mahindra\",MAHINDRA!A78,IF(S$26=\"Valtra\",Valtra!A78,IF(S$26=\"\",\"\",0)))))))))))))))))","v":""}]
[null,null,null,null,null,null,null,null,null,null,null,null,null,null,null,null,null,null,null,{"$f":"IF(S$26=\"AGCO\",AGCO!A79,IF(S$26=\"AGCO White\",'AGCO White'!A79,IF(S$26=\"AGCO Allis\",'AGCO Allis'!A79,IF(S$26=\"Buhler\",Buhler!A79,IF(S$26=\"Case IH\",Case!A79,IF(S$26=\"Challenger\",Challenger!A79,IF(S$26=\"Deutz\",Deutz!A79,IF(S$26=\"John Deere\",'John Deere'!A79,IF(S$26=\"Kubota\",Kubota!A81,IF(S$26=\"Landini\",Landini!A79,IF(S$26=\"Massey Ferguson\",MF!A79,IF(S$26=\"McCormick\",McCormick!A79,IF(S$26=\"New Holland\",NH!A79,IF(S$26=\"Kioti\",KIOTI!A79,IF(S$26=\"Mahindra\",MAHINDRA!A79,IF(S$26=\"Valtra\",Valtra!A79,IF(S$26=\"\",\"\",0)))))))))))))))))","v":""}]
[null,null,null,null,null,null,null,null,null,null,null,null,null,null,null,null,null,null,null,{"$f":"IF(S$26=\"AGCO\",AGCO!A80,IF(S$26=\"AGCO White\",'AGCO White'!A80,IF(S$26=\"AGCO Allis\",'AGCO Allis'!A80,IF(S$26=\"Buhler\",Buhler!A80,IF(S$26=\"Case IH\",Case!A80,IF(S$26=\"Challenger\",Challenger!A80,IF(S$26=\"Deutz\",Deutz!A80,IF(S$26=\"John Deere\",'John Deere'!A80,IF(S$26=\"Kubota\",Kubota!A82,IF(S$26=\"Landini\",Landini!A80,IF(S$26=\"Massey Ferguson\",MF!A80,IF(S$26=\"McCormick\",McCormick!A80,IF(S$26=\"New Holland\",NH!A80,IF(S$26=\"Kioti\",KIOTI!A80,IF(S$26=\"Mahindra\",MAHINDRA!A80,IF(S$26=\"Valtra\",Valtra!A80,IF(S$26=\"\",\"\",0)))))))))))))))))","v":""}]
[null,null,null,null,null,null,null,null,null,null,null,null,null,null,null,null,null,null,null,{"$f":"IF(S$26=\"AGCO\",AGCO!A81,IF(S$26=\"AGCO White\",'AGCO White'!A81,IF(S$26=\"AGCO Allis\",'AGCO Allis'!A81,IF(S$26=\"Buhler\",Buhler!A81,IF(S$26=\"Case IH\",Case!A81,IF(S$26=\"Challenger\",Challenger!A81,IF(S$26=\"Deutz\",Deutz!A81,IF(S$26=\"John Deere\",'John Deere'!A81,IF(S$26=\"Kubota\",Kubota!A83,IF(S$26=\"Landini\",Landini!A81,IF(S$26=\"Massey Ferguson\",MF!A81,IF(S$26=\"McCormick\",McCormick!A81,IF(S$26=\"New Holland\",NH!A81,IF(S$26=\"Kioti\",KIOTI!A81,IF(S$26=\"Mahindra\",MAHINDRA!A81,IF(S$26=\"Valtra\",Valtra!A81,IF(S$26=\"\",\"\",0)))))))))))))))))","v":""}]
[null,null,null,null,null,null,null,null,null,null,null,null,null,null,null,null,null,null,null,{"$f":"IF(S$26=\"AGCO\",AGCO!A82,IF(S$26=\"AGCO White\",'AGCO White'!A82,IF(S$26=\"AGCO Allis\",'AGCO Allis'!A82,IF(S$26=\"Buhler\",Buhler!A82,IF(S$26=\"Case IH\",Case!A82,IF(S$26=\"Challenger\",Challenger!A82,IF(S$26=\"Deutz\",Deutz!A82,IF(S$26=\"John Deere\",'John Deere'!A82,IF(S$26=\"Kubota\",Kubota!A84,IF(S$26=\"Landini\",Landini!A82,IF(S$26=\"Massey Ferguson\",MF!A82,IF(S$26=\"McCormick\",McCormick!A82,IF(S$26=\"New Holland\",NH!A82,IF(S$26=\"Kioti\",KIOTI!A82,IF(S$26=\"Mahindra\",MAHINDRA!A82,IF(S$26=\"Valtra\",Valtra!A82,IF(S$26=\"\",\"\",0)))))))))))))))))","v":""}]
[null,null,null,null,null,null,null,null,null,null,null,null,null,null,null,null,null,null,null,{"$f":"IF(S$26=\"AGCO\",AGCO!A83,IF(S$26=\"AGCO White\",'AGCO White'!A83,IF(S$26=\"AGCO Allis\",'AGCO Allis'!A83,IF(S$26=\"Buhler\",Buhler!A83,IF(S$26=\"Case IH\",Case!A83,IF(S$26=\"Challenger\",Challenger!A83,IF(S$26=\"Deutz\",Deutz!A83,IF(S$26=\"John Deere\",'John Deere'!A83,IF(S$26=\"Kubota\",Kubota!A85,IF(S$26=\"Landini\",Landini!A83,IF(S$26=\"Massey Ferguson\",MF!A83,IF(S$26=\"McCormick\",McCormick!A83,IF(S$26=\"New Holland\",NH!A83,IF(S$26=\"Kioti\",KIOTI!A83,IF(S$26=\"Mahindra\",MAHINDRA!A83,IF(S$26=\"Valtra\",Valtra!A83,IF(S$26=\"\",\"\",0)))))))))))))))))","v":""}]
[null,null,null,null,null,null,null,null,null,null,null,null,null,null,null,null,null,null,null,{"$f":"IF(S$26=\"AGCO\",AGCO!A84,IF(S$26=\"AGCO White\",'AGCO White'!A84,IF(S$26=\"AGCO Allis\",'AGCO Allis'!A84,IF(S$26=\"Buhler\",Buhler!A84,IF(S$26=\"Case IH\",Case!A84,IF(S$26=\"Challenger\",Challenger!A84,IF(S$26=\"Deutz\",Deutz!A84,IF(S$26=\"John Deere\",'John Deere'!A84,IF(S$26=\"Kubota\",Kubota!A86,IF(S$26=\"Landini\",Landini!A84,IF(S$26=\"Massey Ferguson\",MF!A84,IF(S$26=\"McCormick\",McCormick!A84,IF(S$26=\"New Holland\",NH!A84,IF(S$26=\"Kioti\",KIOTI!A84,IF(S$26=\"Mahindra\",MAHINDRA!A84,IF(S$26=\"Valtra\",Valtra!A84,IF(S$26=\"\",\"\",0)))))))))))))))))","v":""}]
[null,null,null,null,null,null,null,null,null,null,null,null,null,null,null,null,null,null,null,{"$f":"IF(S$26=\"AGCO\",AGCO!A85,IF(S$26=\"AGCO White\",'AGCO White'!A85,IF(S$26=\"AGCO Allis\",'AGCO Allis'!A85,IF(S$26=\"Buhler\",Buhler!A85,IF(S$26=\"Case IH\",Case!A85,IF(S$26=\"Challenger\",Challenger!A85,IF(S$26=\"Deutz\",Deutz!A85,IF(S$26=\"John Deere\",'John Deere'!A85,IF(S$26=\"Kubota\",Kubota!A87,IF(S$26=\"Landini\",Landini!A85,IF(S$26=\"Massey Ferguson\",MF!A85,IF(S$26=\"McCormick\",McCormick!A85,IF(S$26=\"New Holland\",NH!A85,IF(S$26=\"Kioti\",KIOTI!A85,IF(S$26=\"Mahindra\",MAHINDRA!A85,IF(S$26=\"Valtra\",Valtra!A85,IF(S$26=\"\",\"\",0)))))))))))))))))","v":""}]
[null,null,null,null,null,null,null,null,null,null,null,null,null,null,null,null,null,null,null,{"$f":"IF(S$26=\"AGCO\",AGCO!A86,IF(S$26=\"AGCO White\",'AGCO White'!A86,IF(S$26=\"AGCO Allis\",'AGCO Allis'!A86,IF(S$26=\"Buhler\",Buhler!A86,IF(S$26=\"Case IH\",Case!A86,IF(S$26=\"Challenger\",Challenger!A86,IF(S$26=\"Deutz\",Deutz!A86,IF(S$26=\"John Deere\",'John Deere'!A86,IF(S$26=\"Kubota\",Kubota!A88,IF(S$26=\"Landini\",Landini!A86,IF(S$26=\"Massey Ferguson\",MF!A86,IF(S$26=\"McCormick\",McCormick!A86,IF(S$26=\"New Holland\",NH!A86,IF(S$26=\"Kioti\",KIOTI!A86,IF(S$26=\"Mahindra\",MAHINDRA!A86,IF(S$26=\"Valtra\",Valtra!A86,IF(S$26=\"\",\"\",0)))))))))))))))))","v":""}]
[null,null,null,null,null,null,null,null,null,null,null,null,null,null,null,null,null,null,null,{"$f":"IF(S$26=\"AGCO\",AGCO!A87,IF(S$26=\"AGCO White\",'AGCO White'!A87,IF(S$26=\"AGCO Allis\",'AGCO Allis'!A87,IF(S$26=\"Buhler\",Buhler!A87,IF(S$26=\"Case IH\",Case!A87,IF(S$26=\"Challenger\",Challenger!A87,IF(S$26=\"Deutz\",Deutz!A87,IF(S$26=\"John Deere\",'John Deere'!A87,IF(S$26=\"Kubota\",Kubota!A89,IF(S$26=\"Landini\",Landini!A87,IF(S$26=\"Massey Ferguson\",MF!A87,IF(S$26=\"McCormick\",McCormick!A87,IF(S$26=\"New Holland\",NH!A87,IF(S$26=\"Kioti\",KIOTI!A87,IF(S$26=\"Mahindra\",MAHINDRA!A87,IF(S$26=\"Valtra\",Valtra!A87,IF(S$26=\"\",\"\",0)))))))))))))))))","v":""}]
[null,null,null,null,null,null,null,null,null,null,null,null,null,null,null,null,null,null,null,{"$f":"IF(S$26=\"AGCO\",AGCO!A88,IF(S$26=\"AGCO White\",'AGCO White'!A88,IF(S$26=\"AGCO Allis\",'AGCO Allis'!A88,IF(S$26=\"Buhler\",Buhler!A88,IF(S$26=\"Case IH\",Case!A88,IF(S$26=\"Challenger\",Challenger!A88,IF(S$26=\"Deutz\",Deutz!A88,IF(S$26=\"John Deere\",'John Deere'!A88,IF(S$26=\"Kubota\",Kubota!A90,IF(S$26=\"Landini\",Landini!A88,IF(S$26=\"Massey Ferguson\",MF!A88,IF(S$26=\"McCormick\",McCormick!A88,IF(S$26=\"New Holland\",NH!A88,IF(S$26=\"Kioti\",KIOTI!A88,IF(S$26=\"Mahindra\",MAHINDRA!A88,IF(S$26=\"Valtra\",Valtra!A88,IF(S$26=\"\",\"\",0)))))))))))))))))","v":""}]
[null,null,null,null,null,null,null,null,null,null,null,null,null,null,null,null,null,null,null,{"$f":"IF(S$26=\"AGCO\",AGCO!A89,IF(S$26=\"AGCO White\",'AGCO White'!A89,IF(S$26=\"AGCO Allis\",'AGCO Allis'!A89,IF(S$26=\"Buhler\",Buhler!A89,IF(S$26=\"Case IH\",Case!A89,IF(S$26=\"Challenger\",Challenger!A89,IF(S$26=\"Deutz\",Deutz!A89,IF(S$26=\"John Deere\",'John Deere'!A89,IF(S$26=\"Kubota\",Kubota!A91,IF(S$26=\"Landini\",Landini!A89,IF(S$26=\"Massey Ferguson\",MF!A89,IF(S$26=\"McCormick\",McCormick!A89,IF(S$26=\"New Holland\",NH!A89,IF(S$26=\"Kioti\",KIOTI!A89,IF(S$26=\"Mahindra\",MAHINDRA!A89,IF(S$26=\"Valtra\",Valtra!A89,IF(S$26=\"\",\"\",0)))))))))))))))))","v":""}]
[null,null,null,null,null,null,null,null,null,null,null,null,null,null,null,null,null,null,null,{"$f":"IF(S$26=\"AGCO\",AGCO!A90,IF(S$26=\"AGCO White\",'AGCO White'!A90,IF(S$26=\"AGCO Allis\",'AGCO Allis'!A90,IF(S$26=\"Buhler\",Buhler!A90,IF(S$26=\"Case IH\",Case!A90,IF(S$26=\"Challenger\",Challenger!A90,IF(S$26=\"Deutz\",Deutz!A90,IF(S$26=\"John Deere\",'John Deere'!A90,IF(S$26=\"Kubota\",Kubota!A92,IF(S$26=\"Landini\",Landini!A90,IF(S$26=\"Massey Ferguson\",MF!A90,IF(S$26=\"McCormick\",McCormick!A90,IF(S$26=\"New Holland\",NH!A90,IF(S$26=\"Kioti\",KIOTI!A90,IF(S$26=\"Mahindra\",MAHINDRA!A90,IF(S$26=\"Valtra\",Valtra!A90,IF(S$26=\"\",\"\",0)))))))))))))))))","v":""}]
[null,null,null,null,null,null,null,null,null,null,null,null,null,null,null,null,null,null,null,{"$f":"IF(S$26=\"AGCO\",AGCO!A91,IF(S$26=\"AGCO White\",'AGCO White'!A91,IF(S$26=\"AGCO Allis\",'AGCO Allis'!A91,IF(S$26=\"Buhler\",Buhler!A91,IF(S$26=\"Case IH\",Case!A91,IF(S$26=\"Challenger\",Challenger!A91,IF(S$26=\"Deutz\",Deutz!A91,IF(S$26=\"John Deere\",'John Deere'!A91,IF(S$26=\"Kubota\",Kubota!A93,IF(S$26=\"Landini\",Landini!A91,IF(S$26=\"Massey Ferguson\",MF!A91,IF(S$26=\"McCormick\",McCormick!A91,IF(S$26=\"New Holland\",NH!A91,IF(S$26=\"Kioti\",KIOTI!A91,IF(S$26=\"Mahindra\",MAHINDRA!A91,IF(S$26=\"Valtra\",Valtra!A91,IF(S$26=\"\",\"\",0)))))))))))))))))","v":""}]
[null,null,null,null,null,null,null,null,null,null,null,null,null,null,null,null,null,null,null,{"$f":"IF(S$26=\"AGCO\",AGCO!A92,IF(S$26=\"AGCO White\",'AGCO White'!A92,IF(S$26=\"AGCO Allis\",'AGCO Allis'!A92,IF(S$26=\"Buhler\",Buhler!A92,IF(S$26=\"Case IH\",Case!A92,IF(S$26=\"Challenger\",Challenger!A92,IF(S$26=\"Deutz\",Deutz!A92,IF(S$26=\"John Deere\",'John Deere'!A92,IF(S$26=\"Kubota\",Kubota!A94,IF(S$26=\"Landini\",Landini!A92,IF(S$26=\"Massey Ferguson\",MF!A92,IF(S$26=\"McCormick\",McCormick!A92,IF(S$26=\"New Holland\",NH!A92,IF(S$26=\"Kioti\",KIOTI!A92,IF(S$26=\"Mahindra\",MAHINDRA!A92,IF(S$26=\"Valtra\",Valtra!A92,IF(S$26=\"\",\"\",0)))))))))))))))))","v":""}]
[null,null,null,null,null,null,null,null,null,null,null,null,null,null,null,null,null,null,null,{"$f":"IF(S$26=\"AGCO\",AGCO!A93,IF(S$26=\"AGCO White\",'AGCO White'!A93,IF(S$26=\"AGCO Allis\",'AGCO Allis'!A93,IF(S$26=\"Buhler\",Buhler!A93,IF(S$26=\"Case IH\",Case!A93,IF(S$26=\"Challenger\",Challenger!A93,IF(S$26=\"Deutz\",Deutz!A93,IF(S$26=\"John Deere\",'John Deere'!A93,IF(S$26=\"Kubota\",Kubota!A95,IF(S$26=\"Landini\",Landini!A93,IF(S$26=\"Massey Ferguson\",MF!A93,IF(S$26=\"McCormick\",McCormick!A93,IF(S$26=\"New Holland\",NH!A93,IF(S$26=\"Kioti\",KIOTI!A93,IF(S$26=\"Mahindra\",MAHINDRA!A93,IF(S$26=\"Valtra\",Valtra!A93,IF(S$26=\"\",\"\",0)))))))))))))))))","v":""}]
[null,null,null,null,null,null,null,null,null,null,null,null,null,null,null,null,null,null,null,{"$f":"IF(S$26=\"AGCO\",AGCO!A94,IF(S$26=\"AGCO White\",'AGCO White'!A94,IF(S$26=\"AGCO Allis\",'AGCO Allis'!A94,IF(S$26=\"Buhler\",Buhler!A94,IF(S$26=\"Case IH\",Case!A94,IF(S$26=\"Challenger\",Challenger!A94,IF(S$26=\"Deutz\",Deutz!A94,IF(S$26=\"John Deere\",'John Deere'!A94,IF(S$26=\"Kubota\",Kubota!A96,IF(S$26=\"Landini\",Landini!A94,IF(S$26=\"Massey Ferguson\",MF!A94,IF(S$26=\"McCormick\",McCormick!A94,IF(S$26=\"New Holland\",NH!A94,IF(S$26=\"Kioti\",KIOTI!A94,IF(S$26=\"Mahindra\",MAHINDRA!A94,IF(S$26=\"Valtra\",Valtra!A94,IF(S$26=\"\",\"\",0)))))))))))))))))","v":""}]
[null,null,null,null,null,null,null,null,null,null,null,null,null,null,null,null,null,null,null,{"$f":"IF(S$26=\"AGCO\",AGCO!A95,IF(S$26=\"AGCO White\",'AGCO White'!A95,IF(S$26=\"AGCO Allis\",'AGCO Allis'!A95,IF(S$26=\"Buhler\",Buhler!A95,IF(S$26=\"Case IH\",Case!A95,IF(S$26=\"Challenger\",Challenger!A95,IF(S$26=\"Deutz\",Deutz!A95,IF(S$26=\"John Deere\",'John Deere'!A95,IF(S$26=\"Kubota\",Kubota!A97,IF(S$26=\"Landini\",Landini!A95,IF(S$26=\"Massey Ferguson\",MF!A95,IF(S$26=\"McCormick\",McCormick!A95,IF(S$26=\"New Holland\",NH!A95,IF(S$26=\"Kioti\",KIOTI!A95,IF(S$26=\"Mahindra\",MAHINDRA!A95,IF(S$26=\"Valtra\",Valtra!A95,IF(S$26=\"\",\"\",0)))))))))))))))))","v":""}]
[null,null,null,null,null,null,null,null,null,null,null,null,null,null,null,null,null,null,null,{"$f":"IF(S$26=\"AGCO\",AGCO!A96,IF(S$26=\"AGCO White\",'AGCO White'!A96,IF(S$26=\"AGCO Allis\",'AGCO Allis'!A96,IF(S$26=\"Buhler\",Buhler!A96,IF(S$26=\"Case IH\",Case!A96,IF(S$26=\"Challenger\",Challenger!A96,IF(S$26=\"Deutz\",Deutz!A96,IF(S$26=\"John Deere\",'John Deere'!A96,IF(S$26=\"Kubota\",Kubota!A98,IF(S$26=\"Landini\",Landini!A96,IF(S$26=\"Massey Ferguson\",MF!A96,IF(S$26=\"McCormick\",McCormick!A96,IF(S$26=\"New Holland\",NH!A96,IF(S$26=\"Kioti\",KIOTI!A96,IF(S$26=\"Mahindra\",MAHINDRA!A96,IF(S$26=\"Valtra\",Valtra!A96,IF(S$26=\"\",\"\",0)))))))))))))))))","v":""}]
[null,null,null,null,null,null,null,null,null,null,null,null,null,null,null,null,null,null,null,{"$f":"IF(S$26=\"AGCO\",AGCO!A97,IF(S$26=\"AGCO White\",'AGCO White'!A97,IF(S$26=\"AGCO Allis\",'AGCO Allis'!A97,IF(S$26=\"Buhler\",Buhler!A97,IF(S$26=\"Case IH\",Case!A97,IF(S$26=\"Challenger\",Challenger!A97,IF(S$26=\"Deutz\",Deutz!A97,IF(S$26=\"John Deere\",'John Deere'!A97,IF(S$26=\"Kubota\",Kubota!A99,IF(S$26=\"Landini\",Landini!A97,IF(S$26=\"Massey Ferguson\",MF!A97,IF(S$26=\"McCormick\",McCormick!A97,IF(S$26=\"New Holland\",NH!A97,IF(S$26=\"Kioti\",KIOTI!A97,IF(S$26=\"Mahindra\",MAHINDRA!A97,IF(S$26=\"Valtra\",Valtra!A97,IF(S$26=\"\",\"\",0)))))))))))))))))","v":""}]
[null,null,null,null,null,null,null,null,null,null,null,null,null,null,null,null,null,null,null,{"$f":"IF(S$26=\"AGCO\",AGCO!A98,IF(S$26=\"AGCO White\",'AGCO White'!A98,IF(S$26=\"AGCO Allis\",'AGCO Allis'!A98,IF(S$26=\"Buhler\",Buhler!A98,IF(S$26=\"Case IH\",Case!A98,IF(S$26=\"Challenger\",Challenger!A98,IF(S$26=\"Deutz\",Deutz!A98,IF(S$26=\"John Deere\",'John Deere'!A98,IF(S$26=\"Kubota\",Kubota!A100,IF(S$26=\"Landini\",Landini!A98,IF(S$26=\"Massey Ferguson\",MF!A98,IF(S$26=\"McCormick\",McCormick!A98,IF(S$26=\"New Holland\",NH!A98,IF(S$26=\"Kioti\",KIOTI!A98,IF(S$26=\"Mahindra\",MAHINDRA!A98,IF(S$26=\"Valtra\",Valtra!A98,IF(S$26=\"\",\"\",0)))))))))))))))))","v":""}]
[null,null,null,null,null,null,null,null,null,null,null,null,null,null,null,null,null,null,null,{"$f":"IF(S$26=\"AGCO\",AGCO!A99,IF(S$26=\"AGCO White\",'AGCO White'!A99,IF(S$26=\"AGCO Allis\",'AGCO Allis'!A99,IF(S$26=\"Buhler\",Buhler!A99,IF(S$26=\"Case IH\",Case!A99,IF(S$26=\"Challenger\",Challenger!A99,IF(S$26=\"Deutz\",Deutz!A99,IF(S$26=\"John Deere\",'John Deere'!A99,IF(S$26=\"Kubota\",Kubota!A101,IF(S$26=\"Landini\",Landini!A99,IF(S$26=\"Massey Ferguson\",MF!A99,IF(S$26=\"McCormick\",McCormick!A99,IF(S$26=\"New Holland\",NH!A99,IF(S$26=\"Kioti\",KIOTI!A99,IF(S$26=\"Mahindra\",MAHINDRA!A99,IF(S$26=\"Valtra\",Valtra!A99,IF(S$26=\"\",\"\",0)))))))))))))))))","v":""}]
[null,null,null,null,null,null,null,null,null,null,null,null,null,null,null,null,null,null,null,{"$f":"IF(S$26=\"AGCO\",AGCO!A100,IF(S$26=\"AGCO White\",'AGCO White'!A100,IF(S$26=\"AGCO Allis\",'AGCO Allis'!A100,IF(S$26=\"Buhler\",Buhler!A100,IF(S$26=\"Case IH\",Case!A100,IF(S$26=\"Challenger\",Challenger!A100,IF(S$26=\"Deutz\",Deutz!A100,IF(S$26=\"John Deere\",'John Deere'!A100,IF(S$26=\"Kubota\",Kubota!A102,IF(S$26=\"Landini\",Landini!A100,IF(S$26=\"Massey Ferguson\",MF!A100,IF(S$26=\"McCormick\",McCormick!A100,IF(S$26=\"New Holland\",NH!A100,IF(S$26=\"Kioti\",KIOTI!A100,IF(S$26=\"Mahindra\",MAHINDRA!A100,IF(S$26=\"Valtra\",Valtra!A100,IF(S$26=\"\",\"\",0)))))))))))))))))","v":""}]
[null,null,null,null,null,null,null,null,null,null,null,null,null,null,null,null,null,null,null,{"$f":"IF(S$26=\"AGCO\",AGCO!A101,IF(S$26=\"AGCO White\",'AGCO White'!A101,IF(S$26=\"AGCO Allis\",'AGCO Allis'!A101,IF(S$26=\"Buhler\",Buhler!A101,IF(S$26=\"Case IH\",Case!A101,IF(S$26=\"Challenger\",Challenger!A101,IF(S$26=\"Deutz\",Deutz!A101,IF(S$26=\"John Deere\",'John Deere'!A101,IF(S$26=\"Kubota\",Kubota!A103,IF(S$26=\"Landini\",Landini!A101,IF(S$26=\"Massey Ferguson\",MF!A101,IF(S$26=\"McCormick\",McCormick!A101,IF(S$26=\"New Holland\",NH!A101,IF(S$26=\"Kioti\",KIOTI!A101,IF(S$26=\"Mahindra\",MAHINDRA!A101,IF(S$26=\"Valtra\",Valtra!A101,IF(S$26=\"\",\"\",0)))))))))))))))))","v":""}]
[null,null,null,null,null,null,null,null,null,null,null,null,null,null,null,null,null,null,null,{"$f":"IF(S$26=\"AGCO\",AGCO!A102,IF(S$26=\"AGCO White\",'AGCO White'!A102,IF(S$26=\"AGCO Allis\",'AGCO Allis'!A102,IF(S$26=\"Buhler\",Buhler!A102,IF(S$26=\"Case IH\",Case!A102,IF(S$26=\"Challenger\",Challenger!A102,IF(S$26=\"Deutz\",Deutz!A102,IF(S$26=\"John Deere\",'John Deere'!A102,IF(S$26=\"Kubota\",Kubota!A104,IF(S$26=\"Landini\",Landini!A102,IF(S$26=\"Massey Ferguson\",MF!A102,IF(S$26=\"McCormick\",McCormick!A102,IF(S$26=\"New Holland\",NH!A102,IF(S$26=\"Kioti\",KIOTI!A102,IF(S$26=\"Mahindra\",MAHINDRA!A102,IF(S$26=\"Valtra\",Valtra!A102,IF(S$26=\"\",\"\",0)))))))))))))))))","v":""}]
[null,null,null,null,null,null,null,null,null,null,null,null,null,null,null,null,null,null,null,{"$f":"IF(S$26=\"AGCO\",AGCO!A103,IF(S$26=\"AGCO White\",'AGCO White'!A103,IF(S$26=\"AGCO Allis\",'AGCO Allis'!A103,IF(S$26=\"Buhler\",Buhler!A103,IF(S$26=\"Case IH\",Case!A103,IF(S$26=\"Challenger\",Challenger!A103,IF(S$26=\"Deutz\",Deutz!A103,IF(S$26=\"John Deere\",'John Deere'!A103,IF(S$26=\"Kubota\",Kubota!A105,IF(S$26=\"Landini\",Landini!A103,IF(S$26=\"Massey Ferguson\",MF!A103,IF(S$26=\"McCormick\",McCormick!A103,IF(S$26=\"New Holland\",NH!A103,IF(S$26=\"Kioti\",KIOTI!A103,IF(S$26=\"Mahindra\",MAHINDRA!A103,IF(S$26=\"Valtra\",Valtra!A103,IF(S$26=\"\",\"\",0)))))))))))))))))","v":""}]
[null,null,null,null,null,null,null,null,null,null,null,null,null,null,null,null,null,null,null,{"$f":"IF(S$26=\"AGCO\",AGCO!A104,IF(S$26=\"AGCO White\",'AGCO White'!A104,IF(S$26=\"AGCO Allis\",'AGCO Allis'!A104,IF(S$26=\"Buhler\",Buhler!A104,IF(S$26=\"Case IH\",Case!A104,IF(S$26=\"Challenger\",Challenger!A104,IF(S$26=\"Deutz\",Deutz!A104,IF(S$26=\"John Deere\",'John Deere'!A104,IF(S$26=\"Kubota\",Kubota!A106,IF(S$26=\"Landini\",Landini!A104,IF(S$26=\"Massey Ferguson\",MF!A104,IF(S$26=\"McCormick\",McCormick!A104,IF(S$26=\"New Holland\",NH!A104,IF(S$26=\"Kioti\",KIOTI!A104,IF(S$26=\"Mahindra\",MAHINDRA!A104,IF(S$26=\"Valtra\",Valtra!A104,IF(S$26=\"\",\"\",0)))))))))))))))))","v":""}]
[null,null,null,null,null,null,null,null,null,null,null,null,null,null,null,null,null,null,null,{"$f":"IF(S$26=\"AGCO\",AGCO!A105,IF(S$26=\"AGCO White\",'AGCO White'!A105,IF(S$26=\"AGCO Allis\",'AGCO Allis'!A105,IF(S$26=\"Buhler\",Buhler!A105,IF(S$26=\"Case IH\",Case!A105,IF(S$26=\"Challenger\",Challenger!A105,IF(S$26=\"Deutz\",Deutz!A105,IF(S$26=\"John Deere\",'John Deere'!A105,IF(S$26=\"Kubota\",Kubota!A107,IF(S$26=\"Landini\",Landini!A105,IF(S$26=\"Massey Ferguson\",MF!A105,IF(S$26=\"McCormick\",McCormick!A105,IF(S$26=\"New Holland\",NH!A105,IF(S$26=\"Kioti\",KIOTI!A105,IF(S$26=\"Mahindra\",MAHINDRA!A105,IF(S$26=\"Valtra\",Valtra!A105,IF(S$26=\"\",\"\",0)))))))))))))))))","v":""}]
[null,null,null,null,null,null,null,null,null,null,null,null,null,null,null,null,null,null,null,{"$f":"IF(S$26=\"AGCO\",AGCO!A106,IF(S$26=\"AGCO White\",'AGCO White'!A106,IF(S$26=\"AGCO Allis\",'AGCO Allis'!A106,IF(S$26=\"Buhler\",Buhler!A106,IF(S$26=\"Case IH\",Case!A106,IF(S$26=\"Challenger\",Challenger!A106,IF(S$26=\"Deutz\",Deutz!A106,IF(S$26=\"John Deere\",'John Deere'!A106,IF(S$26=\"Kubota\",Kubota!A108,IF(S$26=\"Landini\",Landini!A106,IF(S$26=\"Massey Ferguson\",MF!A106,IF(S$26=\"McCormick\",McCormick!A106,IF(S$26=\"New Holland\",NH!A106,IF(S$26=\"Kioti\",KIOTI!A106,IF(S$26=\"Mahindra\",MAHINDRA!A106,IF(S$26=\"Valtra\",Valtra!A106,IF(S$26=\"\",\"\",0)))))))))))))))))","v":""}]
[null,null,null,null,null,null,null,null,null,null,null,null,null,null,null,null,null,null,null,{"$f":"IF(S$26=\"AGCO\",AGCO!A107,IF(S$26=\"AGCO White\",'AGCO White'!A107,IF(S$26=\"AGCO Allis\",'AGCO Allis'!A107,IF(S$26=\"Buhler\",Buhler!A107,IF(S$26=\"Case IH\",Case!A107,IF(S$26=\"Challenger\",Challenger!A107,IF(S$26=\"Deutz\",Deutz!A107,IF(S$26=\"John Deere\",'John Deere'!A107,IF(S$26=\"Kubota\",Kubota!A109,IF(S$26=\"Landini\",Landini!A107,IF(S$26=\"Massey Ferguson\",MF!A107,IF(S$26=\"McCormick\",McCormick!A107,IF(S$26=\"New Holland\",NH!A107,IF(S$26=\"Kioti\",KIOTI!A107,IF(S$26=\"Mahindra\",MAHINDRA!A107,IF(S$26=\"Valtra\",Valtra!A107,IF(S$26=\"\",\"\",0)))))))))))))))))","v":""}]
[null,null,null,null,null,null,null,null,null,null,null,null,null,null,null,null,null,null,null,{"$f":"IF(S$26=\"AGCO\",AGCO!A108,IF(S$26=\"AGCO White\",'AGCO White'!A108,IF(S$26=\"AGCO Allis\",'AGCO Allis'!A108,IF(S$26=\"Buhler\",Buhler!A108,IF(S$26=\"Case IH\",Case!A108,IF(S$26=\"Challenger\",Challenger!A108,IF(S$26=\"Deutz\",Deutz!A108,IF(S$26=\"John Deere\",'John Deere'!A108,IF(S$26=\"Kubota\",Kubota!A110,IF(S$26=\"Landini\",Landini!A108,IF(S$26=\"Massey Ferguson\",MF!A108,IF(S$26=\"McCormick\",McCormick!A108,IF(S$26=\"New Holland\",NH!A108,IF(S$26=\"Kioti\",KIOTI!A108,IF(S$26=\"Mahindra\",MAHINDRA!A108,IF(S$26=\"Valtra\",Valtra!A108,IF(S$26=\"\",\"\",0)))))))))))))))))","v":""}]
[null,null,null,null,null,null,null,null,null,null,null,null,null,null,null,null,null,null,null,{"$f":"IF(S$26=\"AGCO\",AGCO!A109,IF(S$26=\"AGCO White\",'AGCO White'!A109,IF(S$26=\"AGCO Allis\",'AGCO Allis'!A109,IF(S$26=\"Buhler\",Buhler!A109,IF(S$26=\"Case IH\",Case!A109,IF(S$26=\"Challenger\",Challenger!A109,IF(S$26=\"Deutz\",Deutz!A109,IF(S$26=\"John Deere\",'John Deere'!A109,IF(S$26=\"Kubota\",Kubota!A111,IF(S$26=\"Landini\",Landini!A109,IF(S$26=\"Massey Ferguson\",MF!A109,IF(S$26=\"McCormick\",McCormick!A109,IF(S$26=\"New Holland\",NH!A109,IF(S$26=\"Kioti\",KIOTI!A109,IF(S$26=\"Mahindra\",MAHINDRA!A109,IF(S$26=\"Valtra\",Valtra!A109,IF(S$26=\"\",\"\",0)))))))))))))))))","v":""}]
[null,null,null,null,null,null,null,null,null,null,null,null,null,null,null,null,null,null,null,{"$f":"IF(S$26=\"AGCO\",AGCO!A110,IF(S$26=\"AGCO White\",'AGCO White'!A110,IF(S$26=\"AGCO Allis\",'AGCO Allis'!A110,IF(S$26=\"Buhler\",Buhler!A110,IF(S$26=\"Case IH\",Case!A110,IF(S$26=\"Challenger\",Challenger!A110,IF(S$26=\"Deutz\",Deutz!A110,IF(S$26=\"John Deere\",'John Deere'!A110,IF(S$26=\"Kubota\",Kubota!A112,IF(S$26=\"Landini\",Landini!A110,IF(S$26=\"Massey Ferguson\",MF!A110,IF(S$26=\"McCormick\",McCormick!A110,IF(S$26=\"New Holland\",NH!A110,IF(S$26=\"Kioti\",KIOTI!A110,IF(S$26=\"Mahindra\",MAHINDRA!A110,IF(S$26=\"Valtra\",Valtra!A110,IF(S$26=\"\",\"\",0)))))))))))))))))","v":""}]
[null,null,null,null,null,null,null,null,null,null,null,null,null,null,null,null,null,null,null,{"$f":"IF(S$26=\"AGCO\",AGCO!A111,IF(S$26=\"AGCO White\",'AGCO White'!A111,IF(S$26=\"AGCO Allis\",'AGCO Allis'!A111,IF(S$26=\"Buhler\",Buhler!A111,IF(S$26=\"Case IH\",Case!A111,IF(S$26=\"Challenger\",Challenger!A111,IF(S$26=\"Deutz\",Deutz!A111,IF(S$26=\"John Deere\",'John Deere'!A111,IF(S$26=\"Kubota\",Kubota!A113,IF(S$26=\"Landini\",Landini!A111,IF(S$26=\"Massey Ferguson\",MF!A111,IF(S$26=\"McCormick\",McCormick!A111,IF(S$26=\"New Holland\",NH!A111,IF(S$26=\"Kioti\",KIOTI!A111,IF(S$26=\"Mahindra\",MAHINDRA!A111,IF(S$26=\"Valtra\",Valtra!A111,IF(S$26=\"\",\"\",0)))))))))))))))))","v":""}]

{"sheet":"Options","index":5,"n_rows":42,"n_cols":22,"rows_kept":42,"cut":false,"hidden":true,"merged":[[35,9,35,11],[35,13,35,15],[36,9,36,11],[36,13,36,15],[31,11,31,13],[32,11,32,13]]}
["Q21",4491,"Q",21,1,null,5220651,5220650,5220451,9031984,{"$f":"VLOOKUP(A$42,'trip costs'!A:K,6,0)","v":{"$error":"#N/A"}},null,null,{"$f":"\"\"","v":""},null,null,null,null,null,"N/A"]
["Q26",6796,"Q",26,1,null,5220651,5220650,5220451,9031984,{"$f":"VLOOKUP(A$42,'trip costs'!A:K,7,0)","v":{"$error":"#N/A"}},null,null,{"$f":"\"\"","v":""},null,null,null,null,null,"N/A"]
["Q31",4892,"Q",31,1,null,5220651,5220650,5220451,9031984,{"$f":"VLOOKUP(A$42,'trip costs'!A:K,7,0)","v":{"$error":"#N/A"}},null,null,{"$f":"\"\"","v":""},null,null,null,null,null,"N/A"]
["Q36",7617,"Q",36,1,null,5220651,5220650,5220451,9031984,{"$f":"VLOOKUP(A$42,'trip costs'!A:K,7,0)","v":{"$error":"#N/A"}},null,null,{"$f":"\"\"","v":""},null,null,null,null,null,"N/A"]
["Q41",6087,"Q",41,1,null,5220651,5220650,5220451,9031984,{"$f":"VLOOKUP(A$42,'trip costs'!A:K,7,0)","v":{"$error":"#N/A"}},null,null,{"$f":"\"\"","v":""},null,null,null,null,null,"N/A"]
["Q46",8126,"Q",46,1,null,5220651,5220650,5220451,9031984,{"$f":"VLOOKUP(A$42,'trip costs'!A:K,8,0)","v":{"$error":"#N/A"}},null,null,{"$f":"\"\"","v":""},null,null,null,null,null,"N/A"]
["Q51",6408,"Q",51,1,null,5220653,5220652,5220451,9031986,{"$f":"VLOOKUP(A$42,'trip costs'!A:K,8,0)","v":{"$error":"#N/A"}},null,null,"You should consider SoftDrive for this configuration!",null,null,null,null,null,"N/A"]
["Q56",9149,"Q",56,1,null,5220653,5220652,5220451,9031986,{"$f":"VLOOKUP(A$42,'trip costs'!A:K,8,0)","v":{"$error":"#N/A"}},null,null,"You should consider SoftDrive for this configuration!",null,null,null,null,null,"N/A"]
["Q61",7964,"Q",61,1,null,5220653,5220653,5220451,9031988,{"$f":"VLOOKUP(A$42,'trip costs'!A:K,8,0)","v":{"$error":"#N/A"}},null,null,"You should consider SoftDrive for this configuration!",null,null,null,null,null,"N/A"]
["Q66",9515,"Q",66,1,null,5220653,5220653,5220451,9031988,{"$f":"VLOOKUP(A$42,'trip costs'!A:K,9,0)","v":{"$error":"#N/A"}},null,null,"You should consider SoftDrive for this configuration!",null,null,null,null,null,{"$f":"K10*2","v":{"$error":"#N/A"}}]
["Q76",10123,"Q",76,1,null,5220654,5220654,5220451,9031990,{"$f":"VLOOKUP(A$42,'trip costs'!A:K,10,0)","v":{"$error":"#N/A"}},null,null,"You should consider SoftDrive for this configuration!",null,null,null,null,null,{"$f":"K11*2","v":{"$error":"#N/A"}}]
["Q88",13533,"Q",88,1,null,5220655,5220655,5220452,9031994,{"$f":"VLOOKUP(A$42,'trip costs'!A:K,11,0)","v":{"$error":"#N/A"}},null,null,"You should consider SoftDrive for this configuration!",null,null,null,null,null,{"$error":"#N/A"}]
["Q98",15670,"Q",98,1,null,5220655,5220655,5220452,9031996,"N/A",null,null,"You should consider SoftDrive for this configuration!",null,null,null,null,null,{"$error":"#VALUE!"}]
["100C",null,"CA",10,"A1",1,5221796,null,10550453,null,{"$f":"VLOOKUP(A$42,'trip costs'!A:K,4,0)","v":{"$error":"#N/A"}},null,null,{"$f":"\"\"","v":""},null,null,null,null,null,"N/A"]
["140C",null,"CA",14,"A1",1,5221796,null,10550453,null,{"$f":"VLOOKUP(A$42,'trip costs'!A:K,4,0)","v":{"$error":"#N/A"}},null,null,{"$f":"\"\"","v":""},null,null,null,null,null,"N/A"]
["160C",null,"CA",16,"N1",1,5221796,null,10550453,null,{"$f":"VLOOKUP(A$42,'trip costs'!A:K,4,0)","v":{"$error":"#N/A"}},null,null,{"$f":"\"\"","v":""},null,null,null,null,null,"N/A"]
["180C",null,"CA",18,"N1",1,5221796,null,10550453,null,{"$f":"VLOOKUP(A$42,'trip costs'!A:K,4,0)","v":{"$error":"#N/A"}},null,null,{"$f":"\"\"","v":""},null,null,null,null,null,"N/A"]
["X21",3444,"XA",21,"N1",null,5034241,5034241,60010002,null,{"$f":"VLOOKUP(A$42,'trip costs'!A:K,5,0)","v":{"$error":"#N/A"}},null,null,{"$f":"\"\"","v":""},null,null,null,null,null,"N/A"]
["X26",4428,"XA",26,"P1",1,5034241,5034241,60010002,null,{"$f":"VLOOKUP(A$42,'trip costs'!A:K,6,0)","v":{"$error":"#N/A"}},null,null,{"$f":"\"\"","v":""},null,null,null,null,null,"N/A"]
["X31",3600,"XA",31,"N1",null,5034241,5034241,60010002,null,{"$f":"VLOOKUP(A$42,'trip costs'!A:K,6,0)","v":{"$error":"#N/A"}},null,null,{"$f":"\"\"","v":""},null,null,null,null,null,"N/A"]
["X36",4604,"XA",36,"P1",1,5034241,5034241,60010002,null,{"$f":"VLOOKUP(A$42,'trip costs'!A:K,6,0)","v":{"$error":"#N/A"}},null,null,{"$f":"\"\"","v":""},null,null,null,null,null,"N/A"]
["X41",4014,"XA",41,"N1",null,5034241,5034241,60010002,null,{"$f":"VLOOKUP(A$42,'trip costs'!A:K,7,0)","v":{"$error":"#N/A"}},null,null,{"$f":"\"\"","v":""},null,null,null,null,null,"N/A"]
["X46",5069,"XA",46,"P1",1,5034241,5034241,60010002,null,{"$f":"VLOOKUP(A$42,'trip costs'!A:K,7,0)","v":{"$error":"#N/A"}},null,null,{"$f":"\"\"","v":""},null,null,null,null,null,"N/A"]
["X51",4428,"XA",51,"N1",null,5034241,5034241,60010002,null,{"$f":"VLOOKUP(A$42,'trip costs'!A:K,7,0)","v":{"$error":"#N/A"}},null,{"$f":"VLOOKUP(A39,A1:K25,11,0)","v":{"$error":"#N/A"}},"You should consider SoftDrive for this configuration!",null,null,null,null,null,"N/A",null,{"$f":"VLOOKUP(A39,A1:T25,20,0)","v":{"$error":"#N/A"}}]
["X56",5535,"XA",56,"P1",1,5034241,5034241,60010002,null,{"$f":"VLOOKUP(A$42,'trip costs'!A:K,8,0)","v":{"$error":"#N/A"}},null,{"$f":"IF(ISERROR(M24),\"\",M24)","v":""},"You should consider SoftDrive for this configuration!",null,null,null,null,null,"N/A",null,{"$f":"IF(ISERROR(V24),\"\",V24)","v":""}]
[]
[null,"Q Codes","X Codes"]
["Quicke Grey","A","Q"]
["John Deere Green",2,1]
["Kubota Orange",4,"K"]
["Massey Ferguson Red","G","M"]
["New Holland Blue","P","F",null,null,null,null,null,null,{"$f":"VLOOKUP(A39,A1:C25,3,0)","v":{"$error":"#N/A"}},{"$f":"IF(J32=\"Q\",N37,N36)","v":{"$error":"#N/A"}},{"$f":"IF(ISERROR(K32),\"\",K32)","v":""}]
["Case IH Red","E","D",null,null,null,null,null,null,null,null,{"$f":"L32","v":""}]
["Deutz Green",8,8,null,null,null,null,{"$f":"VLOOKUP(LOADERpro!P19,A11:F25,6,0)","v":{"$error":"#N/A"}}]
[null,null,null,null,null,null,null,{"$f":"IF(H34=1,H36,\"\")","v":{"$error":"#N/A"}}]
["X Code",{"$f":"VLOOKUP(A39,A14:C25,3,0)","v":{"$error":"#N/A"}},{"$f":"VLOOKUP(A39,A14:D25,4,0)","v":{"$error":"#N/A"}},{"$f":"VLOOKUP(A39,A14:E25,5,0)","v":{"$error":"#N/A"}},{"$f":"E42","v":{"$error":"#N/A"}},{"$f":"IF(A41=\"Euro\",8,IF(A41=\"Skid Steer\",1,IF(A41=\"PIN ON\",\"O\",\"\")))","v":""},{"$f":"IF(B36=\"CA\",\"OOO\",\"1OO\")","v":{"$error":"#N/A"}},{"$f":"VLOOKUP(LOADERpro!X17,A28:C34,3,0)","v":{"$error":"#N/A"}},{"$f":"IF(H34=1,H36,\"\")","v":{"$error":"#N/A"}},{"$f":"B36&C36&D36&E36&F36&G36&H36&I36","v":{"$error":"#N/A"}},null,null,null,{"$f":"IF(ISERROR(J36),\"\",J36)","v":""}]
["Q Code",{"$f":"VLOOKUP(A39,A1:D25,4,0)","v":{"$error":"#N/A"}},{"$f":"VLOOKUP(A39,A1:E13,5,0)","v":{"$error":"#N/A"}},{"$f":"D42","v":{"$error":"#N/A"}},{"$f":"VLOOKUP(A40,A28:B34,2,0)","v":{"$error":"#N/A"}},{"$f":"IF(A41=\"Euro\",8,IF(A41=\"Skid Steer\",1,\"\"))","v":""},{"$f":"IF(A41=\"Euro\",8,IF(A41=\"Skid Steer\",1,\"\"))","v":""},{"$f":"IF(ISERROR(H38),\"\",H38)","v":5000},null,{"$f":"B37&C37&D37&E37&G37&H37","v":{"$error":"#N/A"}},null,null,null,{"$f":"IF(ISERROR(J37),\"\",J37)","v":""}]
[null,null,null,{"$f":"LOADERpro!N17","v":""},null,null,null,{"$f":"IF(LOADERpro!N17=\"US\",1000,IF(LOADERpro!N17=\"UM\",1000,5000))","v":5000}]
[{"$f":"LOADERpro!P19","v":0}]
[{"$f":"LOADERpro!X17","v":0}]
[{"$f":"LOADERpro!Q12","v":0}]
[{"$f":"LOADERpro!H9","v":0},null,null,{"$f":"VLOOKUP(LOADERpro!R28,'Loader Details'!Q:Y,9,0)","v":{"$error":"#N/A"}},{"$f":"VLOOKUP(LOADERpro!R28,'Loader Details'!Q:X,8,0)","v":{"$error":"#N/A"}}]

{"sheet":"trip costs","index":6,"n_rows":61,"n_cols":23,"rows_kept":61,"cut":false,"hidden":true,"merged":[]}
["FREIGHT","CLASS",null,null,6,7,7,7,7,null,7]
["RATES"]
[]
["STATE",null,null,"100-180C","X21","Q21,X26,X31,X36","Q26-Q41    X41-X51","Q46-Q61, X56","Q66","Q76","Q88",null,"STATE",null,"1847, 1045, 2247","2045, 3045, 180C","2347, 160C SL, 180C SL, 3545, 2427, 2447, 4045, 200N","5045, 200P, 2847, 220N, 6045, S21, 220P","Q31/33, 240N, 3227, 240P, Q26, 260N, Q41, Q36/38","Q46/48, 260P, Q51, Q61, Q56/58","Q66/68","Q76/78","Q88"]
["AL","ALABAMA",null,226,231,278,324,369,{"$f":"H5+150","v":519},{"$f":"H5+200","v":569},{"$f":"H5+250","v":619},null,"AL","ALABAMA",141,226,231,278,324,369,519,569,619]
["AR","ARKANSAS",null,328,349,419,489,559,{"$f":"H6+150","v":709},{"$f":"H6+200","v":759},{"$f":"H6+250","v":809},null,"AR","ARKANSAS",205,328,349,419,489,559,709,759,809]
["AZ","ARIZONA",null,434,457,548,639,730,880,930,980,null,"AZ","ARIZONA",272,434,457,548,639,730,880,930,980]
["CA","CALIFORNIA",null,566,595,714,764,873,1023,1073,1123,null,"CA","CALIFORNIA",354,566,595,714,764,873,1023,1073,1123]
["CO","COLORADO",null,438,460,552,644,675,825,875,925,null,"CO","COLORADO",274,438,460,552,644,675,825,875,925]
["CT","CONNECTICUT",null,318,325,390,455,519,669,719,769,null,"CT","CONNECTICUT",199,318,325,390,455,519,669,719,769]
["DE","DELAWARE",null,245,251,301,351,401,551,601,651,null,"DE","DELAWARE",163,245,251,301,351,401,551,601,651]
["FL","FLORIDA",null,302,310,372,434,496,646,696,746,null,"FL","FLORIDA",189,302,310,372,434,496,646,696,746]
["GA","GEORGIA",null,239,244,293,342,390,540,590,640,null,"GA","GEORGIA",150,239,244,293,342,390,540,590,640]
["IA","IOWA",null,309,313,375,438,500,650,700,750,null,"IA","IOWA",193,309,313,375,438,500,650,700,750]
["ID","IDAHO",null,504,530,636,742,848,998,1048,1098,null,"ID","IDAHO",315,504,530,636,742,848,998,1048,1098]
["IL","ILLINOIS",null,284,287,345,402,459,609,659,709,null,"IL","ILLINOIS",178,284,287,345,402,459,609,659,709]
["IN","INDIANA",null,254,257,308,331,378,528,578,628,null,"IN","INDIANA",163,254,257,308,331,378,528,578,628]
["KS","KANSAS",null,328,349,419,489,559,709,759,809,null,"KS","KANSAS",205,328,349,419,489,559,709,759,809]
["KY","KENTUCKY",null,206,206,247,288,329,479,529,579,null,"KY","KENTUCKY",134,206,206,247,288,329,479,529,579]
["LA","LOUISIANA",null,310,330,396,462,528,678,728,778,null,"LA","LOUISIANA",194,310,330,396,462,528,678,728,778]
["MA","MASSACHUSETS",null,345,367,440,513,586,736,786,836,null,"MA","MASSACHUSETS",216,345,367,440,513,586,736,786,836]
["MD","MARYLAND",null,233,240,287,335,383,533,583,633,null,"MD","MARYLAND",159,233,240,287,335,383,533,583,633]
["ME","MAINE",null,727,773,928,1082,1237,1387,1437,1487,null,"ME","MAINE",455,727,773,928,1082,1237,1387,1437,1487]
["MI","MICHIGAN",null,267,270,324,348,399,549,599,649,null,"MI","MICHIGAN",170,267,270,324,348,399,549,599,649]
["MN","MINNESOTA",null,356,379,454,530,605,755,805,855,null,"MN","MINNESOTA",223,356,379,454,530,605,755,805,855]
["MO","MISSOURI",null,338,360,431,503,575,725,775,825,null,"MO","MISSOURI",211,338,360,431,503,575,725,775,825]
["MS","MISSISSIPPI",null,266,273,327,381,436,586,636,686,null,"MS","MISSISSIPPI",166,266,273,327,381,436,586,636,686]
["MT","MONTANA",null,548,576,691,806,921,1071,1121,1171,null,"MT","MONTANA",342,548,576,691,806,921,1071,1121,1171]
["NC","NORTH CAROLINA",null,170,170,204,238,272,422,472,522,null,"NC","NORTH CAROLINA",119,170,170,204,238,272,422,472,522]
["ND","NORTH DAKOTA",null,401,427,512,597,625,775,825,875,null,"ND","NORTH DAKOTA",251,401,427,512,597,625,775,825,875]
["NE","NEBRASKA",null,359,382,458,535,611,761,811,861,null,"NE","NEBRASKA",225,359,382,458,535,611,761,811,861]
["NH","NEW HAMPSHIRE",null,354,377,453,528,604,754,804,854,null,"NH","NEW HAMPSHIRE",221,354,377,453,528,604,754,804,854]
["NJ","NEW JERSEY",null,345,367,440,513,586,736,786,836,null,"NJ","NEW JERSEY",216,345,367,440,513,586,736,786,836]
["NM","NEW MEXICO",null,384,408,490,571,653,803,853,903,null,"NM","NEW MEXICO",240,384,408,490,571,653,803,853,903]
["NV","NEVADA",null,468,491,590,688,786,936,986,1036,null,"NV","NEVADA",293,468,491,590,688,786,936,986,1036]
["NY","NEW YORK",null,313,321,384,448,513,663,713,763,null,"NY","NEW YORK",195,313,321,384,448,513,663,713,763]
["OH","OHIO",null,202,202,243,283,323,473,523,573,null,"OH","OHIO",145,202,202,243,283,323,473,523,573]
["OK","OKLAHOMA",null,328,349,419,489,559,709,759,809,null,"OK","OKLAHOMA",205,328,349,419,489,559,709,759,809]
["OR","OREGON",null,435,604,724,774,886,1036,1086,1136,null,"OR","OREGON",359,435,604,724,774,886,1036,1086,1136]
["PA","PENNSYLVANIA",null,245,251,301,351,401,551,601,651,null,"PA","PENNSYLVANIA",163,245,251,301,351,401,551,601,651]
["SC","SOUTH CAROLINA",null,184,184,221,258,295,445,495,545,null,"SC","SOUTH CAROLINA",124,184,184,221,258,295,445,495,545]
["SD","SOUTH DAKOTA",null,365,388,465,543,620,770,820,870,null,"SD","SOUTH DAKOTA",228,365,388,465,543,620,770,820,870]
["TN","TENNESSEE",null,235,240,288,336,384,534,584,634,null,"TN","TENNESSEE",147,235,240,288,336,384,534,584,634]
["TX","TEXAS",null,355,378,454,529,605,755,815,855,null,"TX","TEXAS",222,355,378,454,529,605,755,805,855]
["UT","UTAH",null,494,519,623,665,760,910,960,1010,null,"UT","UTAH",309,494,519,623,665,760,910,960,1010]
["VT","VERMONT",null,354,377,453,528,604,754,804,854,null,"VT","VERMONT",221,354,377,453,528,604,754,804,854]
["VA","VIRGINIA",null,158,158,183,212,243,393,443,493,null,"VA","VIRGINIA",127,158,158,183,212,243,393,443,493]
["WA","WASHINGTON",null,420,586,644,752,859,1009,1059,1109,null,"WA","WASHINGTON",349,420,586,644,752,859,1009,1059,1109]
["WI","WISCONSIN",null,352,370,444,518,592,742,792,842,null,"WI","WISCONSIN",221,352,370,444,518,592,742,792,842]
["WV","WEST VIRGINIA",null,205,205,246,287,328,478,528,578,null,"WV","WEST VIRGINIA",152,205,205,246,287,328,478,528,578]
["WY","WYOMING",null,774,824,988,1153,1318,1468,1518,1568,null,"WY","WYOMING",484,774,824,988,1153,1318,1468,1518,1568]
["NS",null,null,300,400,400,400,400,400,400,400]
["AB",null,null,400,600,600,600,600,600,600,600]
["BC",null,null,500,700,700,700,700,700,700,700]
["SK",null,null,400,600,600,600,600,600,600,600]
["MB",null,null,400,600,600,600,600,600,600,600]
["ON",null,null,200,250,250,300,300,300,300,300]
["QC",null,null,300,300,300,400,400,400,400,400]
["NB",null,null,400,500,500,500,500,500,500,500]
["PE",null,null,400,500,500,500,500,500,500,500]
["NL",null,null,400,500,500,500,500,500,500,500]

{"sheet":"Loader Details","index":7,"n_rows":477,"n_cols":32,"rows_kept":477,"cut":false,"hidden":true,"merged":[]}
["Tractor Model","2/4","Version","Width","Note #1","Note #2","Note #3","Note #4","Loaders","Loaders","Loaders","Loaders","Loaders","Loaders","Loaders","Loaders","Subframe","Grill Guard",null,"2 Mechanical","2 Electric","2 Hose","3 Hose","X Width #","Q Width #","Conversion Kit","Cab","Rops"]
["GT45, 55 and \"A\"","2/4","ROPS/CAB","DS",4,5,null,null,{"$f":"\"\"","v":""},{"$f":"\"\"","v":""},{"$f":"\"\"","v":""},{"$f":"\"\"","v":""},"Q21",{"$f":"\"\"","v":""},"Q26",{"$f":"\"\"","v":""},14310515,null,null,"15155BAA",{"$f":"\"\"","v":""},{"$f":"\"\"","v":""},{"$f":"\"\"","v":""},{"$f":"IF(D2=\"US\",\"U\",\"L\")","v":"L"},{"$f":"IF(D2=\"DS\",\"3\",IF(D2=\"DM\",\"4\",IF(D2=\"US\",\"1\",IF(D2=\"UM\",\"2\",IF(D2=\"DL\",\"3\")))))","v":"3"},null,{"$f":"\"\"","v":""},{"$f":"\"\"","v":""}]
["GT55 and \"A\"","2/4","CAB","DS",4,6,null,null,{"$f":"\"\"","v":""},{"$f":"\"\"","v":""},{"$f":"\"\"","v":""},{"$f":"\"\"","v":""},"Q21",{"$f":"\"\"","v":""},"Q26",{"$f":"\"\"","v":""},14310505,null,null,"15155BAA",{"$f":"\"\"","v":""},{"$f":"\"\"","v":""},{"$f":"\"\"","v":""},{"$f":"IF(D3=\"US\",\"U\",\"L\")","v":"L"},{"$f":"IF(D3=\"DS\",\"3\",IF(D3=\"DM\",\"4\",IF(D3=\"US\",\"1\",IF(D3=\"UM\",\"2\",IF(D3=\"DL\",\"3\")))))","v":"3"},null,{"$f":"\"\"","v":""},{"$f":"\"\"","v":""}]
["GT65, 75 and \"A\"","2/4","ROPS/CAB","DS",4,5,null,null,{"$f":"\"\"","v":""},{"$f":"\"\"","v":""},{"$f":"\"\"","v":""},{"$f":"\"\"","v":""},"Q21","Q31","Q26","Q36",14310495,null,null,"15155BAA",{"$f":"\"\"","v":""},{"$f":"\"\"","v":""},{"$f":"\"\"","v":""},"L","3",null,{"$f":"\"\"","v":""},{"$f":"\"\"","v":""}]
["GT75 and \"A\"","2/4","CAB","DS",4,6,null,null,{"$f":"\"\"","v":""},{"$f":"\"\"","v":""},{"$f":"\"\"","v":""},{"$f":"\"\"","v":""},"Q31",{"$f":"\"\"","v":""},"Q36",{"$f":"\"\"","v":""},14310615,null,null,"15155BAA",{"$f":"\"\"","v":""},{"$f":"\"\"","v":""},{"$f":"\"\"","v":""},"L","3",null,{"$f":"\"\"","v":""},{"$f":"\"\"","v":""}]
["LT75, 90","2/4","ROPS/CAB",{"$f":"IF(E6=11,\"US\",\"DM\")","v":"DM"},1,null,null,null,"X41",{"$f":"\"\"","v":""},"X46",{"$f":"\"\"","v":""},"Q41",{"$f":"\"\"","v":""},"Q46",{"$f":"\"\"","v":""},14321115,null,null,"15013BFA",{"$f":"\"\"","v":""},{"$f":"\"\"","v":""},{"$f":"\"\"","v":""},"L","4",null,{"$f":"\"\"","v":""},{"$f":"\"\"","v":""}]
["LT \"A\" 75, 85, 90, 95 AUTO IV TIER II and III","2/4","ROPS/CAB","DM",1,null,null,null,"X41","X51","X46","X56","Q41","Q51","Q46","Q56",14322815,null,null,"15013BFA",{"$f":"\"\"","v":""},{"$f":"\"\"","v":""},{"$f":"\"\"","v":""},"L","4",null,{"$f":"\"\"","v":""},{"$f":"\"\"","v":""}]
["LT \"A\" 75, 90 Speed Shift","2/4","ROPS/CAB","DM",1,null,null,null,"X41","X51","X46","X56","Q41","Q51","Q46","Q56",14322325,null,null,"15013BFA",{"$f":"\"\"","v":""},{"$f":"\"\"","v":""},{"$f":"\"\"","v":""},"L","4",null,{"$f":"\"\"","v":""},{"$f":"\"\"","v":""}]
["RT 100, 120 Auto Quad",4,"CAB","DM",3,null,null,null,{"$f":"\"\"","v":""},{"$f":"\"\"","v":""},{"$f":"\"\"","v":""},{"$f":"\"\"","v":""},"Q61",{"$f":"\"\"","v":""},"Q66",{"$f":"\"\"","v":""},14320505,null,null,"15020BAA",{"$f":"\"\"","v":""},{"$f":"\"\"","v":""},{"$f":"\"\"","v":""},"L","4",null,{"$f":"\"\"","v":""},{"$f":"\"\"","v":""}]
["RT 100, 120 Dyna VT",4,"CAB","DM",2,3,null,null,{"$f":"\"\"","v":""},{"$f":"\"\"","v":""},{"$f":"\"\"","v":""},{"$f":"\"\"","v":""},"Q61",{"$f":"\"\"","v":""},"Q66",{"$f":"\"\"","v":""},14320515,null,null,"15020BAA",{"$f":"\"\"","v":""},{"$f":"\"\"","v":""},{"$f":"\"\"","v":""},"L","4",null,{"$f":"\"\"","v":""},{"$f":"\"\"","v":""}]
["RT 135, 150 Auto Quad",4,"CAB","DM",3,null,null,null,{"$f":"\"\"","v":""},{"$f":"\"\"","v":""},{"$f":"\"\"","v":""},{"$f":"\"\"","v":""},{"$f":"\"\"","v":""},{"$f":"\"\"","v":""},"Q76",{"$f":"\"\"","v":""},14320945,null,null,"15020BAA",{"$f":"\"\"","v":""},{"$f":"\"\"","v":""},{"$f":"\"\"","v":""},"L","4",null,{"$f":"\"\"","v":""},{"$f":"\"\"","v":""}]
["RT 135, 150 Dyna VT",4,"CAB","DM",2,3,null,null,{"$f":"\"\"","v":""},{"$f":"\"\"","v":""},{"$f":"\"\"","v":""},{"$f":"\"\"","v":""},{"$f":"\"\"","v":""},{"$f":"\"\"","v":""},"Q76",{"$f":"\"\"","v":""},14320855,null,null,"15020BAA",{"$f":"\"\"","v":""},{"$f":"\"\"","v":""},{"$f":"\"\"","v":""},"L","4",null,{"$f":"\"\"","v":""},{"$f":"\"\"","v":""}]
["RT \"A\" 100, 120 TIER 2 Auto IV",4,"CAB","DM",3,null,null,null,{"$f":"\"\"","v":""},{"$f":"\"\"","v":""},{"$f":"\"\"","v":""},{"$f":"\"\"","v":""},"Q61",{"$f":"\"\"","v":""},"Q66",{"$f":"\"\"","v":""},14322355,null,null,"15020BAA",{"$f":"\"\"","v":""},{"$f":"\"\"","v":""},{"$f":"\"\"","v":""},"L","4",null,{"$f":"\"\"","v":""},{"$f":"\"\"","v":""}]
["RT \"A\" 100, 120 TIER 2 CVT",4,"CAB","DM",2,3,null,null,{"$f":"\"\"","v":""},{"$f":"\"\"","v":""},{"$f":"\"\"","v":""},{"$f":"\"\"","v":""},"Q61",{"$f":"\"\"","v":""},"Q66",{"$f":"\"\"","v":""},14322345,null,null,"15020BAA",{"$f":"\"\"","v":""},{"$f":"\"\"","v":""},{"$f":"\"\"","v":""},"L","4",null,{"$f":"\"\"","v":""},{"$f":"\"\"","v":""}]
["RT \"A\" 140, 155 TIER 2 Auto IV",4,"CAB","DM",3,null,null,null,{"$f":"\"\"","v":""},{"$f":"\"\"","v":""},{"$f":"\"\"","v":""},{"$f":"\"\"","v":""},{"$f":"\"\"","v":""},{"$f":"\"\"","v":""},"Q76",{"$f":"\"\"","v":""},14320415,null,null,"15020BAA",{"$f":"\"\"","v":""},{"$f":"\"\"","v":""},{"$f":"\"\"","v":""},"L","4",null,{"$f":"\"\"","v":""},{"$f":"\"\"","v":""}]
["RT \"A\" 140, 155 TIER 2 CVT",4,"CAB","DM",2,3,null,null,{"$f":"\"\"","v":""},{"$f":"\"\"","v":""},{"$f":"\"\"","v":""},{"$f":"\"\"","v":""},{"$f":"\"\"","v":""},{"$f":"\"\"","v":""},"Q76",{"$f":"\"\"","v":""},14320445,null,null,"15020BAA",{"$f":"\"\"","v":""},{"$f":"\"\"","v":""},{"$f":"\"\"","v":""},"L","4",null,{"$f":"\"\"","v":""},{"$f":"\"\"","v":""}]
["RT \"A\" 110, 120 TIER 3 Auto VI",4,"CAB","DM",3,7,null,null,{"$f":"\"\"","v":""},{"$f":"\"\"","v":""},{"$f":"\"\"","v":""},{"$f":"\"\"","v":""},"Q61",{"$f":"\"\"","v":""},"Q66",{"$f":"\"\"","v":""},14325535,null,null,"15020BAA","15015FCA",{"$f":"\"\"","v":""},{"$f":"\"\"","v":""},"L","4",null,{"$f":"\"\"","v":""},{"$f":"\"\"","v":""}]
["RT \"A\" 110, 120 TIER 3 CVT",4,"CAB","DM",3,7,null,null,{"$f":"\"\"","v":""},{"$f":"\"\"","v":""},{"$f":"\"\"","v":""},{"$f":"\"\"","v":""},"Q61",{"$f":"\"\"","v":""},"Q66",{"$f":"\"\"","v":""},14325525,null,null,"15020BAA","15015FCA",{"$f":"\"\"","v":""},{"$f":"\"\"","v":""},"L","4",null,{"$f":"\"\"","v":""},{"$f":"\"\"","v":""}]
["RT \"A\" 140, 155 TIER 3 Auto VI",4,"CAB","DM",3,7,null,null,{"$f":"\"\"","v":""},{"$f":"\"\"","v":""},{"$f":"\"\"","v":""},{"$f":"\"\"","v":""},{"$f":"\"\"","v":""},{"$f":"\"\"","v":""},"Q76",{"$f":"\"\"","v":""},14323295,null,null,"15020BAA","15015FCA",{"$f":"\"\"","v":""},{"$f":"\"\"","v":""},"L","4",null,{"$f":"\"\"","v":""},{"$f":"\"\"","v":""}]
["RT \"A\" 140, 155 TIER 3 CVT",4,"CAB","DM",2,7,null,null,{"$f":"\"\"","v":""},{"$f":"\"\"","v":""},{"$f":"\"\"","v":""},{"$f":"\"\"","v":""},{"$f":"\"\"","v":""},{"$f":"\"\"","v":""},"Q76",{"$f":"\"\"","v":""},14325515,null,null,"15020BAA","15015FCA",{"$f":"\"\"","v":""},{"$f":"\"\"","v":""},"L","4",null,{"$f":"\"\"","v":""},{"$f":"\"\"","v":""}]
["RT 165A AUTO VI Tier 3 Serial # <T176049",4,"CAB","DM",1,null,null,null,{"$f":"\"\"","v":""},{"$f":"\"\"","v":""},{"$f":"\"\"","v":""},{"$f":"\"\"","v":""},{"$f":"\"\"","v":""},{"$f":"\"\"","v":""},"Q76",{"$f":"\"\"","v":""},14322465,null,null,"15020BAA","15015FCA",{"$f":"\"\"","v":""},{"$f":"\"\"","v":""},"L","4",null,{"$f":"\"\"","v":""},{"$f":"\"\"","v":""}]
["RT 165A AUTO VI Tier 3 Serial # >T189041",4,"CAB","DL",1,null,null,null,null,null,null,null,null,{"$f":"\"\"","v":""},"Q88",{"$f":"\"\"","v":""},14330965,null,null,"15020BAA","15015FCA",{"$f":"\"\"","v":""},{"$f":"\"\"","v":""},"L","3",null,{"$f":"\"\"","v":""},{"$f":"\"\"","v":""}]
["RT 165A Tier 3 CVT",4,"CAB","DL",1,null,null,null,null,null,null,null,null,{"$f":"\"\"","v":""},"Q88",{"$f":"\"\"","v":""},14331105,null,null,"15020BAA","15015FCA",{"$f":"\"\"","v":""},{"$f":"\"\"","v":""},"L","3",null,{"$f":"\"\"","v":""},{"$f":"\"\"","v":""}]
["RT 180A from serial # T198034",4,"CAB","DL",1,null,null,null,null,null,null,null,null,{"$f":"\"\"","v":""},"Q88",{"$f":"\"\"","v":""},14330965,null,null,"15020BAA","15015FCA",{"$f":"\"\"","v":""},{"$f":"\"\"","v":""},"L","3",null,{"$f":"\"\"","v":""},{"$f":"\"\"","v":""}]
["RT 180A Tier 3 CVT",4,"CAB","DL",1,null,null,null,null,null,null,null,null,{"$f":"\"\"","v":""},"Q88",{"$f":"\"\"","v":""},14331105,null,null,"15020BAA","15015FCA",{"$f":"\"\"","v":""},{"$f":"\"\"","v":""},"L","3",null,{"$f":"\"\"","v":""},{"$f":"\"\"","v":""}]
["DT \"A\" 180, 200, 220, 240",4,"CAB","DL",2,null,null,null,{"$f":"\"\"","v":""},{"$f":"\"\"","v":""},{"$f":"\"\"","v":""},{"$f":"\"\"","v":""},{"$f":"\"\"","v":""},{"$f":"\"\"","v":""},"Q88",{"$f":"\"\"","v":""},14330115,null,null,"15110BAA",{"$f":"\"\"","v":""},{"$f":"\"\"","v":""},{"$f":"\"\"","v":""},"L","3",null,{"$f":"\"\"","v":""},{"$f":"\"\"","v":""}]
["DT \"B\" 205, 225, 250, 275","4","CAB","DL",8,null,null,null,{"$f":"\"\"","v":""},{"$f":"\"\"","v":""},{"$f":"\"\"","v":""},{"$f":"\"\"","v":""},{"$f":"\"\"","v":""},{"$f":"\"\"","v":""},"Q88",{"$f":"\"\"","v":""},14331054,null,null,{"$f":"\"\"","v":""},"15177FCA",{"$f":"\"\"","v":""},{"$f":"\"\"","v":""},"L","3",null,{"$f":"\"\"","v":""},{"$f":"\"\"","v":""}]
["AGCO","","","DM","",null,null,null,{"$f":"\"\"","v":""},{"$f":"\"\"","v":""},{"$f":"\"\"","v":""},{"$f":"\"\"","v":""},{"$f":"\"\"","v":""},{"$f":"\"\"","v":""},{"$f":"\"\"","v":""},{"$f":"\"\"","v":""},"",null,null,{"$f":"\"\"","v":""},{"$f":"\"\"","v":""},{"$f":"\"\"","v":""},{"$f":"\"\"","v":""},"L","4",null,{"$f":"\"\"","v":""},{"$f":"\"\"","v":""}]
["LT70, 85 ROPS","2/4","ROPS","US",11,99,null,null,"X41",{"$f":"\"\"","v":""},"X46",{"$f":"\"\"","v":""},"Q41",{"$f":"\"\"","v":""},"Q46",{"$f":"\"\"","v":""},345515,null,null,"15096BAA",{"$f":"\"\"","v":""},{"$f":"\"\"","v":""},{"$f":"\"\"","v":""},"U","1",null,{"$f":"\"\"","v":""},{"$f":"\"\"","v":""}]
["LT70, 85 CAB","2/4","CAB","US",11,99,null,null,"X41",{"$f":"\"\"","v":""},"X46",{"$f":"\"\"","v":""},"Q41",{"$f":"\"\"","v":""},"Q46",{"$f":"\"\"","v":""},10347235,null,null,"15096BAA",{"$f":"\"\"","v":""},{"$f":"\"\"","v":""},{"$f":"\"\"","v":""},"U","1",null,{"$f":"\"\"","v":""},{"$f":"\"\"","v":""}]
["RT95, 115","2/4","CAB","US",11,99,null,null,"X51",{"$f":"\"\"","v":""},"X56",{"$f":"\"\"","v":""},"Q51",{"$f":"\"\"","v":""},"Q56",{"$f":"\"\"","v":""},345365,null,null,"15108BAA",{"$f":"\"\"","v":""},{"$f":"\"\"","v":""},{"$f":"\"\"","v":""},"U","1",null,{"$f":"\"\"","v":""},{"$f":"\"\"","v":""}]
["RT 130, 145","4","CAB","UM",9,12,99,null,{"$f":"\"\"","v":""},{"$f":"\"\"","v":""},{"$f":"\"\"","v":""},{"$f":"\"\"","v":""},{"$f":"\"\"","v":""},{"$f":"\"\"","v":""},"Q76",{"$f":"\"\"","v":""},320635,null,null,"15115BAA",{"$f":"\"\"","v":""},{"$f":"\"\"","v":""},{"$f":"\"\"","v":""},"L","2",null,{"$f":"\"\"","v":""},{"$f":"\"\"","v":""}]
["AGCO ALLIS","","","DM","",null,null,null,{"$f":"\"\"","v":""},{"$f":"\"\"","v":""},{"$f":"\"\"","v":""},{"$f":"\"\"","v":""},{"$f":"\"\"","v":""},{"$f":"\"\"","v":""},{"$f":"\"\"","v":""},{"$f":"\"\"","v":""},"",null,null,{"$f":"\"\"","v":""},{"$f":"\"\"","v":""},{"$f":"\"\"","v":""},{"$f":"\"\"","v":""},"L","4",null,{"$f":"\"\"","v":""},{"$f":"\"\"","v":""}]
["8745, 8765 (Valtra Engine)","2/4","ROPS","US",11,99,null,null,"X41",{"$f":"\"\"","v":""},"X46",{"$f":"\"\"","v":""},"Q41",{"$f":"\"\"","v":""},"Q46",{"$f":"\"\"","v":""},345495,null,null,"15096BAA",{"$f":"\"\"","v":""},{"$f":"\"\"","v":""},{"$f":"\"\"","v":""},"U","1",null,{"$f":"\"\"","v":""},{"$f":"\"\"","v":""}]
["8745, 8765 (Cummins Engine)","2/4","ROPS","US",11,99,null,null,"X41",{"$f":"\"\"","v":""},"X46",{"$f":"\"\"","v":""},"Q41",{"$f":"\"\"","v":""},"Q46",{"$f":"\"\"","v":""},345515,null,null,"15096BAA",{"$f":"\"\"","v":""},{"$f":"\"\"","v":""},{"$f":"\"\"","v":""},"U","1",null,{"$f":"\"\"","v":""},{"$f":"\"\"","v":""}]
["8745, 8765 (Cummins Engine)","2/4","CAB","US",11,99,null,null,"X41",{"$f":"\"\"","v":""},"X46",{"$f":"\"\"","v":""},"Q41",{"$f":"\"\"","v":""},"Q46",{"$f":"\"\"","v":""},10347235,null,null,"15096BAA",{"$f":"\"\"","v":""},{"$f":"\"\"","v":""},{"$f":"\"\"","v":""},"U","1",null,{"$f":"\"\"","v":""},{"$f":"\"\"","v":""}]
["8775, 8785 (Valtra Engine)","2/4","CAB","US",11,99,null,null,"X51",{"$f":"\"\"","v":""},"X56",{"$f":"\"\"","v":""},"Q51",{"$f":"\"\"","v":""},"Q56",{"$f":"\"\"","v":""},345355,null,null,"15108BAA",{"$f":"\"\"","v":""},{"$f":"\"\"","v":""},{"$f":"\"\"","v":""},"U","1",null,{"$f":"\"\"","v":""},{"$f":"\"\"","v":""}]
["8775, 8785 (Cummins Engine)","2/4","CAB","US",11,99,null,null,"X51",{"$f":"\"\"","v":""},"X56",{"$f":"\"\"","v":""},"Q51",{"$f":"\"\"","v":""},"Q56",{"$f":"\"\"","v":""},345365,null,null,"15108BAA",{"$f":"\"\"","v":""},{"$f":"\"\"","v":""},{"$f":"\"\"","v":""},"U","1",null,{"$f":"\"\"","v":""},{"$f":"\"\"","v":""}]
["4650, 4660 ","2/4","ROPS","US",10,11,99,null,"X31",{"$f":"\"\"","v":""},"X36",{"$f":"\"\"","v":""},"Q21","Q31","Q26","Q36",341555,null,1,317148,{"$f":"\"\"","v":""},{"$f":"\"\"","v":""},{"$f":"\"\"","v":""},"U",1,1,{"$f":"\"\"","v":""},{"$f":"\"\"","v":""}]
["5650, 5660","2/4","ROPS","US",10,11,99,null,"X31",{"$f":"\"\"","v":""},"X36",{"$f":"\"\"","v":""},"Q21","Q31","Q26","Q36",10347155,null,1,317257,{"$f":"\"\"","v":""},{"$f":"\"\"","v":""},{"$f":"\"\"","v":""},"U",1,1,{"$f":"\"\"","v":""},{"$f":"\"\"","v":""}]
["5670, 5680","2/4","ROPS","US",10,11,99,null,"X31","X41","X36","X46","Q31","Q41","Q36","Q46",10347015,null,1,317149,{"$f":"\"\"","v":""},{"$f":"\"\"","v":""},{"$f":"\"\"","v":""},"U",1,1,{"$f":"\"\"","v":""},{"$f":"\"\"","v":""}]
["8610, 8630","2/4","CAB","UM",10,12,99,null,{"$f":"\"\"","v":""},{"$f":"\"\"","v":""},{"$f":"\"\"","v":""},{"$f":"\"\"","v":""},{"$f":"\"\"","v":""},{"$f":"\"\"","v":""},"Q56","Q66",320255,null,1,317121,{"$f":"\"\"","v":""},{"$f":"\"\"","v":""},{"$f":"\"\"","v":""},"L","2",1,{"$f":"\"\"","v":""},{"$f":"\"\"","v":""}]
["AGCO WHITE","","","DM","",null,null,null,{"$f":"\"\"","v":""},{"$f":"\"\"","v":""},{"$f":"\"\"","v":""},{"$f":"\"\"","v":""},{"$f":"\"\"","v":""},{"$f":"\"\"","v":""},{"$f":"\"\"","v":""},{"$f":"\"\"","v":""},"",null,null,{"$f":"\"\"","v":""},{"$f":"\"\"","v":""},{"$f":"\"\"","v":""},{"$f":"\"\"","v":""},"L","4",null,{"$f":"\"\"","v":""},{"$f":"\"\"","v":""}]
["6410, 6510","2/4","ROPS","US",11,99,null,null,"X41",{"$f":"\"\"","v":""},"X46",{"$f":"\"\"","v":""},"Q41",{"$f":"\"\"","v":""},"Q46",{"$f":"\"\"","v":""},345515,null,null,"15096BAA",{"$f":"\"\"","v":""},{"$f":"\"\"","v":""},{"$f":"\"\"","v":""},"U","1",null,{"$f":"\"\"","v":""},{"$f":"\"\"","v":""}]
["6410, 6510","2/4","CAB","US",11,99,null,null,"X41",{"$f":"\"\"","v":""},"X46",{"$f":"\"\"","v":""},"Q41",{"$f":"\"\"","v":""},"Q46",{"$f":"\"\"","v":""},10347235,null,null,"15096BAA",{"$f":"\"\"","v":""},{"$f":"\"\"","v":""},{"$f":"\"\"","v":""},"U","1",null,{"$f":"\"\"","v":""},{"$f":"\"\"","v":""}]
["6710, 6810'","2/4","CAB","US",11,99,null,null,"X51",{"$f":"\"\"","v":""},"X56",{"$f":"\"\"","v":""},"Q51",{"$f":"\"\"","v":""},"Q56",{"$f":"\"\"","v":""},345365,null,null,"15108BAA",{"$f":"\"\"","v":""},{"$f":"\"\"","v":""},{"$f":"\"\"","v":""},"U","1",null,{"$f":"\"\"","v":""},{"$f":"\"\"","v":""}]
["8310, 8410","2/4","CAB","UM",12,99,null,null,{"$f":"\"\"","v":""},{"$f":"\"\"","v":""},{"$f":"\"\"","v":""},{"$f":"\"\"","v":""},{"$f":"\"\"","v":""},{"$f":"\"\"","v":""},"Q76",{"$f":"\"\"","v":""},320635,null,null,"15115BAA",{"$f":"\"\"","v":""},{"$f":"\"\"","v":""},{"$f":"\"\"","v":""},"L","2",null,{"$f":"\"\"","v":""},{"$f":"\"\"","v":""}]
["6045 ROPS","2/4","ROPS","US",10,11,99,null,"X31",{"$f":"\"\"","v":""},"X36",{"$f":"\"\"","v":""},"Q21","Q31","Q26","Q36",10347155,null,1,317257,{"$f":"\"\"","v":""},{"$f":"\"\"","v":""},{"$f":"\"\"","v":""},"U",1,1,{"$f":"\"\"","v":""},{"$f":"\"\"","v":""}]
["6065 ROPS","2/4","ROPS","US",10,11,99,null,"X31",{"$f":"\"\"","v":""},"X36","X46","Q31","Q41","Q36","Q46",345475,null,1,317149,{"$f":"\"\"","v":""},{"$f":"\"\"","v":""},{"$f":"\"\"","v":""},"U","1",1,{"$f":"\"\"","v":""},{"$f":"\"\"","v":""}]
["6065 CAB","2/4","CAB","US",10,11,99,null,"X31",{"$f":"\"\"","v":""},"X36","X46","Q31","Q41","Q36","Q46",341715,null,1,317151,{"$f":"\"\"","v":""},{"$f":"\"\"","v":""},{"$f":"\"\"","v":""},"U","1",1,{"$f":"\"\"","v":""},{"$f":"\"\"","v":""}]
["6105 CAB","2/4","CAB","UM",10,12,99,null,{"$f":"\"\"","v":""},{"$f":"\"\"","v":""},{"$f":"\"\"","v":""},{"$f":"\"\"","v":""},{"$f":"\"\"","v":""},{"$f":"\"\"","v":""},"Q56","Q66",320255,null,1,317121,{"$f":"\"\"","v":""},{"$f":"\"\"","v":""},{"$f":"\"\"","v":""},"L","2",1,{"$f":"\"\"","v":""},{"$f":"\"\"","v":""}]
["Genesis 2145, 2160, 2180, 2210","2/4","CAB","DL",99,null,null,null,{"$f":"\"\"","v":""},{"$f":"\"\"","v":""},{"$f":"\"\"","v":""},{"$f":"\"\"","v":""},{"$f":"\"\"","v":""},{"$f":"\"\"","v":""},"Q88",{"$f":"\"\"","v":""},14330135,null,null,"15091BAA","15091FCA",{"$f":"\"\"","v":""},{"$f":"\"\"","v":""},"L","3",null,{"$f":"\"\"","v":""},{"$f":"\"\"","v":""}]
["Farmall 65A, 75A","2/4","ROPS",{"$f":"IF(E53=11,\"US\",\"DM\")","v":"DM"},{"$f":"\"\"","v":""},{"$f":"\"\"","v":""},{"$f":"\"\"","v":""},{"$f":"\"\"","v":""},"X21",{"$f":"\"\"","v":""},"X26",{"$f":"\"\"","v":""},"Q21",{"$f":"\"\"","v":""},"Q26",{"$f":"\"\"","v":""},14327694,{"$f":"\"\"","v":""},{"$f":"\"\"","v":""},"15463BAA",{"$f":"\"\"","v":""},{"$f":"\"\"","v":""},{"$f":"\"\"","v":""},"L",4,{"$f":"\"\"","v":""},{"$f":"\"\"","v":""},{"$f":"\"\"","v":""},{"$f":"\"\"","v":""},{"$f":"\"\"","v":""},{"$f":"\"\"","v":""},{"$f":"\"\"","v":""}]
["JX55, 60, 65, 70","2/4","ROPS/CAB","DM","",null,null,null,"X21","X31","X26","X36","Q21","Q31","Q26","Q36",14321295,null,null,"15025BAA",{"$f":"\"\"","v":""},{"$f":"\"\"","v":""},{"$f":"\"\"","v":""},"L","4",null,{"$f":"\"\"","v":""},{"$f":"\"\"","v":""}]
["JX1075N, JX1095N","4","ROPS/CAB","DS",4,15,16,null,{"$f":"\"\"","v":""},{"$f":"\"\"","v":""},{"$f":"\"\"","v":""},{"$f":"\"\"","v":""},"Q21",{"$f":"\"\"","v":""},"Q26",{"$f":"\"\"","v":""},14310324,null,null,"15086BAA",{"$f":"\"\"","v":""},{"$f":"\"\"","v":""},{"$f":"\"\"","v":""},"L","3",null,{"$f":"\"\"","v":""},{"$f":"\"\"","v":""}]
["JX75, 80, 85, 90","2/4","ROPS/CAB","DM","",null,null,null,"X31","X41","X36","X46","Q31","Q41","Q36","Q46",14321285,null,null,"15025BAA",{"$f":"\"\"","v":""},{"$f":"\"\"","v":""},{"$f":"\"\"","v":""},"L","4",null,{"$f":"\"\"","v":""},{"$f":"\"\"","v":""}]
["Farmall 90, 95, JX95","2/4","ROPS/CAB","DM",94,null,null,null,"X41",{"$f":"\"\"","v":""},"X46",{"$f":"\"\"","v":""},"Q41",{"$f":"\"\"","v":""},"Q46",{"$f":"\"\"","v":""},14324725,null,null,"15025BAA",{"$f":"\"\"","v":""},{"$f":"\"\"","v":""},{"$f":"\"\"","v":""},"L","4",null,{"$f":"\"\"","v":""},{"$f":"\"\"","v":""}]
["Farmall 65C, 75C (Straddle Jesi)","2/4","ROPS/CAB",{"$f":"IF(E58=11,\"US\",\"DM\")","v":"DM"},null,null,null,null,"X21",{"$f":"\"\"","v":""},"X26",{"$f":"\"\"","v":""},"Q21",{"$f":"\"\"","v":""},"Q26",{"$f":"\"\"","v":""},14323765,null,{"$f":"\"\"","v":""},"15053BAA",{"$f":"\"\"","v":""},"10378214D",{"$f":"\"\"","v":""},"L",4,null,{"$f":"\"\"","v":""},{"$f":"\"\"","v":""}]
["Farmall 85C, 95C (Straddle Jesi)","2/4","ROPS/CAB","DM",null,null,null,null,"X21","X31","X26","X36","Q21","Q31","Q26","Q36",14324025,null,{"$f":"\"\"","v":""},"15053BAA",{"$f":"\"\"","v":""},"10378214D",{"$f":"\"\"","v":""},"L",4,null,{"$f":"\"\"","v":""},{"$f":"\"\"","v":""}]
["JX1060C, 1070C, 1075C","2/4","ROPS/CAB","DM",18,null,null,null,"X21","X31","X26","X36","Q21","Q31","Q26","Q36",14321994,null,null,"15023BAA",{"$f":"\"\"","v":""},"10378214D",{"$f":"\"\"","v":""},"L","4",null,{"$f":"\"\"","v":""},{"$f":"\"\"","v":""}]
["JX1085C, 1095C","2/4","ROPS/CAB","DM","",null,null,null,"X21","X31","X26","X36","Q21","Q31","Q26","Q36",14324025,null,null,"15023BAA",{"$f":"\"\"","v":""},"10378214D",{"$f":"\"\"","v":""},"L","4",null,{"$f":"\"\"","v":""},{"$f":"\"\"","v":""}]
["FARMALL 85U, 95U, 105U  (JESI)","2/4","ROPS/CAB",{"$f":"IF(E62=11,\"US\",\"DM\")","v":"DM"},"",null,null,null,"X31","X41","X36","X46","Q31","Q41","Q36","Q46",14323955,null,null,"15048BAA","15019FCA","10378209D",{"$f":"\"\"","v":""},{"$f":"IF(D62=\"US\",\"U\",\"L\")","v":"L"},{"$f":"IF(D62=\"DS\",\"3\",IF(D62=\"DM\",\"4\",IF(D62=\"US\",\"1\",IF(D62=\"UM\",\"2\",IF(D62=\"DL\",\"3\")))))","v":"4"},null,{"$f":"\"\"","v":""},{"$f":"\"\"","v":""}]
["JX1080U, JX1090U, 1100U (JESI)","2/4","ROPS/CAB","DM","",null,null,null,"X31","X41","X36","X46","Q31","Q41","Q36","Q46",14323955,null,null,"15048BAA","15019FCA","10378209D",{"$f":"\"\"","v":""},"L","4",null,{"$f":"\"\"","v":""},{"$f":"\"\"","v":""}]
["Farmall 70, 80 ","2/4","ROPS/CAB",{"$f":"IF(E64=11,\"US\",\"DM\")","v":"DM"},94,null,null,null,"X21","X31","X26","X36","Q21","Q31","Q26","Q36",14325485,null,null,"15025BAA",{"$f":"\"\"","v":""},{"$f":"\"\"","v":""},{"$f":"\"\"","v":""},{"$f":"IF(D64=\"US\",\"U\",\"L\")","v":"L"},{"$f":"IF(D64=\"DS\",\"3\",IF(D64=\"DM\",\"4\",IF(D64=\"US\",\"1\",IF(D64=\"UM\",\"2\",IF(D64=\"DL\",\"3\")))))","v":"4"},null,{"$f":"\"\"","v":""},{"$f":"\"\"","v":""}]
["JX70, 80, 90, 100U","2/4","ROPS/CAB","DM","",null,null,null,"X31","X41","X36","X46","Q31","Q41","Q36","Q46",14321215,null,null,"15048BAA","15019FCA","10378209D",{"$f":"\"\"","v":""},"L","4",null,{"$f":"\"\"","v":""},{"$f":"\"\"","v":""}]
["MXU 100, 110 Limited","2/4","ROPS/CAB","DM","",null,null,null,"X41","X51","X46","X56","Q41","Q51","Q46","Q56",14323354,null,null,"15039BAA","15039FCA"," 10378137D","10378141M","L","4",null,{"$f":"\"\"","v":""},{"$f":"\"\"","v":""}]
["MXU 100, 110 Limited","2/4","ROPS/CAB",{"$f":"IF(E67=11,\"US\",\"DM\")","v":"DM"},"",null,null,null,"X41","X51","X46","X56","Q41","Q51","Q46","Q56",14323354,null,null,"15039BAA","15039FCA"," 10378137D","10378141M",{"$f":"IF(D67=\"US\",\"U\",\"L\")","v":"L"},{"$f":"IF(D67=\"DS\",\"3\",IF(D67=\"DM\",\"4\",IF(D67=\"US\",\"1\",IF(D67=\"UM\",\"2\",IF(D67=\"DL\",\"3\")))))","v":"4"},null,{"$f":"\"\"","v":""},{"$f":"\"\"","v":""}]
["MXU 115, 130 Value (Open Center)","2/4","ROPS/CAB","DM","",null,null,null,{"$f":"\"\"","v":""},{"$f":"\"\"","v":""},{"$f":"\"\"","v":""},{"$f":"\"\"","v":""},"Q51","Q61","Q56","Q66",14323364,null,null,"15018BAB","15021FCA"," 10378137D","10378141M","L","4",null,{"$f":"\"\"","v":""},{"$f":"\"\"","v":""}]
["Maxxum 110, 120, 130 T3","2/4","ROPS/CAB","DM","",null,null,null,"X41","X51","X46","X56","Q41","Q51","Q46","Q56",14324847,null,null,"15302BAB","15039FCA"," 10378338D","10378338M","L","4",null,{"$f":"\"\"","v":""},{"$f":"\"\"","v":""}]
["Maxxum 115,125,140 T3","2/4","ROPS/CAB",{"$f":"IF(E70=11,\"US\",\"DM\")","v":"DM"},"",null,null,null,{"$f":"\"\"","v":""},{"$f":"\"\"","v":""},{"$f":"\"\"","v":""},{"$f":"\"\"","v":""},"Q51","Q61","Q56","Q66",14324857,null,null,"15302BAB","15039FCA"," 10378338D","10378338M",{"$f":"IF(D70=\"US\",\"U\",\"L\")","v":"L"},{"$f":"IF(D70=\"DS\",\"3\",IF(D70=\"DM\",\"4\",IF(D70=\"US\",\"1\",IF(D70=\"UM\",\"2\",IF(D70=\"DL\",\"3\")))))","v":"4"},null,{"$f":"\"\"","v":""},{"$f":"\"\"","v":""}]
["MX 180 - 335","4","CAB","DL",17,null,null,null,{"$f":"\"\"","v":""},{"$f":"\"\"","v":""},{"$f":"\"\"","v":""},{"$f":"\"\"","v":""},{"$f":"\"\"","v":""},{"$f":"\"\"","v":""},"Q88",{"$f":"\"\"","v":""},14330044,null,null,"15090BAA","15090FCA",{"$f":"\"\"","v":""},{"$f":"\"\"","v":""},"L","3",null,{"$f":"\"\"","v":""},{"$f":"\"\"","v":""}]
["Magnum 180 - 280 (Teir III)","4","CAB","DL",17,105,null,null,{"$f":"\"\"","v":""},{"$f":"\"\"","v":""},{"$f":"\"\"","v":""},{"$f":"\"\"","v":""},{"$f":"\"\"","v":""},{"$f":"\"\"","v":""},"Q88",{"$f":"\"\"","v":""},14330044,null,null,"15090BAA","15090FCA",{"$f":"\"\"","v":""},{"$f":"\"\"","v":""},"L","3",null,{"$f":"\"\"","v":""},{"$f":"\"\"","v":""}]
["3230-4240, C70 - C100 4WD","2/4","ROPS/CAB","DM",13,10,null,null,"X31","X41","X36","X46","Q31","Q41","Q36","Q46",14322205,null,1,317204,{"$f":"\"\"","v":""},{"$f":"\"\"","v":""},{"$f":"\"\"","v":""},"L","4",1,{"$f":"\"\"","v":""},{"$f":"\"\"","v":""}]
["3230-4240, C70 - C100 2WD","2","ROPS",{"$f":"IF(E74=11,\"US\",\"DM\")","v":"DM"},"",null,null,null,"X31",{"$f":"\"\"","v":""},"X36",{"$f":"\"\"","v":""},"Q31",{"$f":"\"\"","v":""},"Q36",{"$f":"\"\"","v":""},14322244,null,1,10317683,{"$f":"\"\"","v":""},{"$f":"\"\"","v":""},{"$f":"\"\"","v":""},{"$f":"IF(D74=\"US\",\"U\",\"L\")","v":"L"},{"$f":"IF(D74=\"DS\",\"3\",IF(D74=\"DM\",\"4\",IF(D74=\"US\",\"1\",IF(D74=\"UM\",\"2\",IF(D74=\"DL\",\"3\")))))","v":"4"},1,{"$f":"\"\"","v":""},{"$f":"\"\"","v":""}]
["685-985 AND 695-995 4WD","2/4","ROPS/CAB","DM",13,10,null,null,"X31","X41","X36","X46","Q31","Q41","Q36","Q46",14322205,null,1,317204,{"$f":"\"\"","v":""},{"$f":"\"\"","v":""},{"$f":"\"\"","v":""},"L","4",1,{"$f":"\"\"","v":""},{"$f":"\"\"","v":""}]
["685-985 AND 695-995 2WD","2","ROPS",{"$f":"IF(E76=11,\"US\",\"DM\")","v":"DM"},"",null,null,null,"X31",{"$f":"\"\"","v":""},"X36",{"$f":"\"\"","v":""},"Q31",{"$f":"\"\"","v":""},"Q36",{"$f":"\"\"","v":""},14322244,null,1,10317683,{"$f":"\"\"","v":""},{"$f":"\"\"","v":""},{"$f":"\"\"","v":""},{"$f":"IF(D76=\"US\",\"U\",\"L\")","v":"L"},{"$f":"IF(D76=\"DS\",\"3\",IF(D76=\"DM\",\"4\",IF(D76=\"US\",\"1\",IF(D76=\"UM\",\"2\",IF(D76=\"DL\",\"3\")))))","v":"4"},1,{"$f":"\"\"","v":""},{"$f":"\"\"","v":""}]
["CX70, 80, 90, 100","2/4","ROPS/CAB","DM","",null,null,null,"X31","X41","X36","X46","Q31","Q41","Q36","Q46",14322675,null,null,"15040BAA","15040FCA",{"$f":"\"\"","v":""},{"$f":"\"\"","v":""},"L","4",null,{"$f":"\"\"","v":""},{"$f":"\"\"","v":""}]
["5130 - 5250 6 Cylinder","2/4","ROPS/CAB","DM","",null,null,null,{"$f":"\"\"","v":""},{"$f":"\"\"","v":""},{"$f":"\"\"","v":""},{"$f":"\"\"","v":""},"Q51","Q61","Q56","Q66",14320144,null,null,"15054BAC",{"$f":"\"\"","v":""},{"$f":"\"\"","v":""},{"$f":"\"\"","v":""},"L","4",null,{"$f":"\"\"","v":""},{"$f":"\"\"","v":""}]
["MX80C - 100C","4","ROPS/CAB","DM",14,null,null,null,"X41","X51","X46","X56","Q41","Q51","Q46","Q56",14320164,null,null,"15044BAA","15044FCA",{"$f":"\"\"","v":""},{"$f":"\"\"","v":""},"L","4",null,{"$f":"\"\"","v":""},{"$f":"\"\"","v":""}]
["MX100-135","2/4","ROPS/CAB","DM",14,null,null,null,{"$f":"\"\"","v":""},{"$f":"\"\"","v":""},{"$f":"\"\"","v":""},{"$f":"\"\"","v":""},"Q61",{"$f":"\"\"","v":""},"Q66","Q76",14320044,null,null,"15044BAA","15044FCA",{"$f":"\"\"","v":""},{"$f":"\"\"","v":""},"L","4",null,{"$f":"\"\"","v":""},{"$f":"\"\"","v":""}]
["MX150-170","2/4","ROPS/CAB","DM",14,null,null,null,{"$f":"\"\"","v":""},{"$f":"\"\"","v":""},{"$f":"\"\"","v":""},{"$f":"\"\"","v":""},{"$f":"\"\"","v":""},{"$f":"\"\"","v":""},"Q76",{"$f":"\"\"","v":""},14320044,null,null,"15044BAA","15044FCA",{"$f":"\"\"","v":""},{"$f":"\"\"","v":""},"L","4",null,{"$f":"\"\"","v":""},{"$f":"\"\"","v":""}]
["MXM 130, 140 Value (Open Center)","2/4","ROPS/CAB","DM",100,null,null,null,{"$f":"\"\"","v":""},{"$f":"\"\"","v":""},{"$f":"\"\"","v":""},{"$f":"\"\"","v":""},"Q61",{"$f":"\"\"","v":""},"Q66",{"$f":"\"\"","v":""},14322834,null,null,"15089BAA",{"$f":"\"\"","v":""},"10378137D"," 10378141M","L","4",null,{"$f":"\"\"","v":""},{"$f":"\"\"","v":""}]
["MXM 120, 130, 140, 155 Pro (Closed Center)","2/4","ROPS/CAB","DM",100,null,null,null,{"$f":"\"\"","v":""},{"$f":"\"\"","v":""},{"$f":"\"\"","v":""},{"$f":"\"\"","v":""},"Q61",{"$f":"\"\"","v":""},"Q66",{"$f":"\"\"","v":""},14322834,null,null,"15052BAA","15052FCA","10378137D"," 10378141M","L","4",null,{"$f":"\"\"","v":""},{"$f":"\"\"","v":""}]
["MXM 175, 190 Pro","2/4","ROPS/CAB","DM",100,null,null,null,{"$f":"\"\"","v":""},{"$f":"\"\"","v":""},{"$f":"\"\"","v":""},{"$f":"\"\"","v":""},{"$f":"\"\"","v":""},{"$f":"\"\"","v":""},"Q76",{"$f":"\"\"","v":""},14322834,null,null,"15052BAA","15052FCA","10378137D"," 10378141M","L","4",null,{"$f":"\"\"","v":""},{"$f":"\"\"","v":""}]
["Magnum 7110 - 7150 / 7210 - 7250 / 8910 - 8950","2/4","CAB","DL","",null,null,null,{"$f":"\"\"","v":""},{"$f":"\"\"","v":""},{"$f":"\"\"","v":""},{"$f":"\"\"","v":""},{"$f":"\"\"","v":""},{"$f":"\"\"","v":""},"Q88",{"$f":"\"\"","v":""},14330924,null,null,"15079BAA","15079FCA",{"$f":"\"\"","v":""},{"$f":"\"\"","v":""},"L","3",null,{"$f":"\"\"","v":""},{"$f":"\"\"","v":""}]
["5120'","2/4","ROPS/CAB","DM","",null,null,null,"X41",{"$f":"\"\"","v":""},"X46",{"$f":"\"\"","v":""},"Q41",{"$f":"\"\"","v":""},"X46",{"$f":"\"\"","v":""},14326114,null,null,"15054BAC",{"$f":"\"\"","v":""},{"$f":"\"\"","v":""},{"$f":"\"\"","v":""},"L","4",null,{"$f":"\"\"","v":""},{"$f":"\"\"","v":""}]
["5220 4 Cylinder","2/4","ROPS/CAB","US",10,99,null,null,"X41","X51","X46","X56","Q41","Q51","Q46","Q56",344224,null,null,"15054BAC",null,{"$f":"\"\"","v":""},{"$f":"\"\"","v":""},"U",1,null,{"$f":"\"\"","v":""},{"$f":"\"\"","v":""}]
["C50, C60, 3210, 3220","2/4","ROPS ","US",10,11,99,null,"X31",{"$f":"\"\"","v":""},"X36",{"$f":"\"\"","v":""},"Q21","Q31","Q26","Q36",345004,null,1,317204,{"$f":"\"\"","v":""},{"$f":"\"\"","v":""},{"$f":"\"\"","v":""},"U",1,1,{"$f":"\"\"","v":""},{"$f":"\"\"","v":""}]
["CX50, CX60","4","ROPS/CAB","US",10,99,null,null,"X31",{"$f":"\"\"","v":""},"X36",{"$f":"\"\"","v":""},"Q31",{"$f":"\"\"","v":""},"Q36",{"$f":"\"\"","v":""},345434,null,null,"15040BAA",{"$f":"\"\"","v":""},{"$f":"\"\"","v":""},{"$f":"\"\"","v":""},"U",1,null,{"$f":"\"\"","v":""},{"$f":"\"\"","v":""}]
["MT 315B, 325B, 335B and 345B","2/4","ROPS/CAB","DM","",null,null,null,"X21",{"$f":"\"\"","v":""},"X26",{"$f":"\"\"","v":""},"Q21",{"$f":"\"\"","v":""},"Q26",{"$f":"\"\"","v":""},14326695,null,null,"15094BAA",null,{"$f":"\"\"","v":""},{"$f":"\"\"","v":""},"L","4",null,{"$f":"\"\"","v":""},{"$f":"\"\"","v":""}]
["MT 425B Dyna-4 ","2/4","ROPS/CAB","DM","",null,null,null,"X41","X51","X46","X56","Q41","Q51","Q46","Q56",14324425,null,null,"15013BFA","15013FCA",{"$f":"\"\"","v":""},{"$f":"\"\"","v":""},"L","4",null,{"$f":"\"\"","v":""},{"$f":"\"\"","v":""}]
["MT 425B Speedshift","2/4","ROPS/CAB","DM","",null,null,null,"X41","X51","X46","X56","Q41","Q51","Q46","Q56",14322625,null,null,"15013BFA","15013FCA",{"$f":"\"\"","v":""},{"$f":"\"\"","v":""},"L","4",null,{"$f":"\"\"","v":""},{"$f":"\"\"","v":""}]
["MT 445B, 455B, 465B Dyna 4","2/4","ROPS/CAB","DM","",null,null,null,"X41","X51","X46","X56","Q41","Q51","Q46","Q56",14324425,null,null,"15013BFA","15013FCA",{"$f":"\"\"","v":""},{"$f":"\"\"","v":""},"L","4",null,{"$f":"\"\"","v":""},{"$f":"\"\"","v":""}]
["MT 445B, 455B, 465B Speedshift","2/4","ROPS/CAB","DM","",null,null,null,{"$f":"\"\"","v":""},{"$f":"\"\"","v":""},{"$f":"\"\"","v":""},{"$f":"\"\"","v":""},"Q51","Q61","Q66","Q76",14322625,null,null,"15013BFA","15013FCA",{"$f":"\"\"","v":""},{"$f":"\"\"","v":""},"L","4",null,{"$f":"\"\"","v":""},{"$f":"\"\"","v":""}]
["MT 525B Dyna Power VI","2/4","ROPS/CAB","DM",19,null,null,null,{"$f":"\"\"","v":""},{"$f":"\"\"","v":""},{"$f":"\"\"","v":""},{"$f":"\"\"","v":""},"Q51","Q61","Q66","Q76",14321305,null,null,"15324BFA","15324FCA",{"$f":"\"\"","v":""},{"$f":"\"\"","v":""},"L","4",null,{"$f":"\"\"","v":""},{"$f":"\"\"","v":""}]
["MT 525B Dyna-VT","2/4","ROPS/CAB","DM",19,null,null,null,{"$f":"\"\"","v":""},{"$f":"\"\"","v":""},{"$f":"\"\"","v":""},{"$f":"\"\"","v":""},"Q51","Q61","Q66","Q76",14320435,null,null,"15324BFA","15324FCA",{"$f":"\"\"","v":""},{"$f":"\"\"","v":""},"L","4",null,{"$f":"\"\"","v":""},{"$f":"\"\"","v":""}]
["MT 525B Dynashift","2/4","ROPS/CAB","DM",19,null,null,null,{"$f":"\"\"","v":""},{"$f":"\"\"","v":""},{"$f":"\"\"","v":""},{"$f":"\"\"","v":""},"Q51","Q61","Q66","Q76",14320395,null,null,"15324BFA","15324FCA",{"$f":"\"\"","v":""},{"$f":"\"\"","v":""},"L","4",null,{"$f":"\"\"","v":""},{"$f":"\"\"","v":""}]
["MT 525B Tier3 Auto Power VI","2/4","ROPS/CAB","DM",19,null,null,null,{"$f":"\"\"","v":""},{"$f":"\"\"","v":""},{"$f":"\"\"","v":""},{"$f":"\"\"","v":""},"Q51","Q61","Q66","Q76",14322155,null,null,"15324BFA","15324FCA",{"$f":"\"\"","v":""},{"$f":"\"\"","v":""},"L","4",null,{"$f":"\"\"","v":""},{"$f":"\"\"","v":""}]
["MT 525B Tier3 Tech Star CVT","2/4","ROPS/CAB","DM",19,null,null,null,{"$f":"\"\"","v":""},{"$f":"\"\"","v":""},{"$f":"\"\"","v":""},{"$f":"\"\"","v":""},"Q51","Q61","Q66","Q76",14323125,null,null,"15324BFA","15324FCA",{"$f":"\"\"","v":""},{"$f":"\"\"","v":""},"L","4",null,{"$f":"\"\"","v":""},{"$f":"\"\"","v":""}]
["MT 535B & 545B Dyna Power VI","2/4","ROPS/CAB","DM",19,null,null,null,{"$f":"\"\"","v":""},{"$f":"\"\"","v":""},{"$f":"\"\"","v":""},{"$f":"\"\"","v":""},"Q51","Q61","Q66","Q76",14321305,null,null,"15324BFA","15324FCA",{"$f":"\"\"","v":""},{"$f":"\"\"","v":""},"L","4",null,{"$f":"\"\"","v":""},{"$f":"\"\"","v":""}]
["MT 535B & 545B Dyna-VT","2/4","ROPS/CAB","DM",19,null,null,null,{"$f":"\"\"","v":""},{"$f":"\"\"","v":""},{"$f":"\"\"","v":""},{"$f":"\"\"","v":""},"Q51","Q61","Q66","Q76",14320435,null,null,"15324BFA","15324FCA",{"$f":"\"\"","v":""},{"$f":"\"\"","v":""},"L","4",null,{"$f":"\"\"","v":""},{"$f":"\"\"","v":""}]
["MT 535B & 545B Dynashift","2/4","ROPS/CAB","DM",19,null,null,null,{"$f":"\"\"","v":""},{"$f":"\"\"","v":""},{"$f":"\"\"","v":""},{"$f":"\"\"","v":""},"Q51","Q61","Q66","Q76",14320395,null,null,"15324BFA","15324FCA",{"$f":"\"\"","v":""},{"$f":"\"\"","v":""},"L","4",null,{"$f":"\"\"","v":""},{"$f":"\"\"","v":""}]
["MT 535B & 545B Tier3 Auto Power VI","2/4","ROPS/CAB","DM",19,null,null,null,{"$f":"\"\"","v":""},{"$f":"\"\"","v":""},{"$f":"\"\"","v":""},{"$f":"\"\"","v":""},"Q51","Q61","Q66","Q76",14322155,null,null,"15324BFA","15324FCA",{"$f":"\"\"","v":""},{"$f":"\"\"","v":""},"L","4",null,{"$f":"\"\"","v":""},{"$f":"\"\"","v":""}]
["MT 535B & 545B Tier3 Tech Star CVT","2/4","ROPS/CAB","DM",19,null,null,null,{"$f":"\"\"","v":""},{"$f":"\"\"","v":""},{"$f":"\"\"","v":""},{"$f":"\"\"","v":""},"Q51","Q61","Q66","Q76",14323125,null,null,"15324BFA","15324FCA",{"$f":"\"\"","v":""},{"$f":"\"\"","v":""},"L","4",null,{"$f":"\"\"","v":""},{"$f":"\"\"","v":""}]
["MT 555B & 565B Dyna-VT","2/4","ROPS/CAB","DM",19,null,null,null,{"$f":"\"\"","v":""},{"$f":"\"\"","v":""},{"$f":"\"\"","v":""},{"$f":"\"\"","v":""},{"$f":"\"\"","v":""},{"$f":"\"\"","v":""},"Q76",{"$f":"\"\"","v":""},14321165,null,null,"15324BFA","15324FCA",{"$f":"\"\"","v":""},{"$f":"\"\"","v":""},"L","4",{"$f":"\"\"","v":""},{"$f":"\"\"","v":""},{"$f":"\"\"","v":""}]
["MT 555B & 565B Dynashift","2/4","ROPS/CAB","DM",19,null,null,null,{"$f":"\"\"","v":""},{"$f":"\"\"","v":""},{"$f":"\"\"","v":""},{"$f":"\"\"","v":""},{"$f":"\"\"","v":""},{"$f":"\"\"","v":""},"Q76",{"$f":"\"\"","v":""},14321145,null,null,"15324BFA","15324FCA",{"$f":"\"\"","v":""},{"$f":"\"\"","v":""},"L","4",{"$f":"\"\"","v":""},{"$f":"\"\"","v":""},{"$f":"\"\"","v":""}]
["MT 555B, 565B, 575B Tier3 Auto Power VI","2/4","ROPS/CAB","DM",19,null,null,null,{"$f":"\"\"","v":""},{"$f":"\"\"","v":""},{"$f":"\"\"","v":""},{"$f":"\"\"","v":""},{"$f":"\"\"","v":""},{"$f":"\"\"","v":""},"Q76",{"$f":"\"\"","v":""},14323315,null,null,"15324BFA","15324FCA",{"$f":"\"\"","v":""},{"$f":"\"\"","v":""},"L","4",{"$f":"\"\"","v":""},{"$f":"\"\"","v":""},{"$f":"\"\"","v":""}]
["MT 555B, 565B, 575B Tier3 Tech Star CVT","2/4","ROPS/CAB","DM",19,null,null,null,{"$f":"\"\"","v":""},{"$f":"\"\"","v":""},{"$f":"\"\"","v":""},{"$f":"\"\"","v":""},{"$f":"\"\"","v":""},{"$f":"\"\"","v":""},"Q76",{"$f":"\"\"","v":""},14323325,null,null,"15324BFA","15324FCA",{"$f":"\"\"","v":""},{"$f":"\"\"","v":""},"L","4",{"$f":"\"\"","v":""},{"$f":"\"\"","v":""},{"$f":"\"\"","v":""}]
["MT 585B CVT, 595B CVT","2/4","ROPS/CAB","DL","",null,null,null,{"$f":"\"\"","v":""},{"$f":"\"\"","v":""},{"$f":"\"\"","v":""},{"$f":"\"\"","v":""},{"$f":"\"\"","v":""},{"$f":"\"\"","v":""},"Q88",{"$f":"\"\"","v":""},14331105,null,null,"15324BFA","15324FCA",{"$f":"\"\"","v":""},{"$f":"\"\"","v":""},"L","3",{"$f":"\"\"","v":""},{"$f":"\"\"","v":""},{"$f":"\"\"","v":""}]
["MT 635B, 645B, 655B, 665B","2/4","ROPS/CAB","DL","",null,null,null,{"$f":"\"\"","v":""},{"$f":"\"\"","v":""},{"$f":"\"\"","v":""},{"$f":"\"\"","v":""},{"$f":"\"\"","v":""},{"$f":"\"\"","v":""},"Q88",{"$f":"\"\"","v":""},14330115,null,null,"15110BAA",{"$f":"\"\"","v":""},{"$f":"\"\"","v":""},{"$f":"\"\"","v":""},"L","3",{"$f":"\"\"","v":""},{"$f":"\"\"","v":""},{"$f":"\"\"","v":""}]
["MT425, 445, 455, 465","2/4","ROPS","US",11,99,null,null,"X41",{"$f":"\"\"","v":""},"X46",{"$f":"\"\"","v":""},"Q41",{"$f":"\"\"","v":""},"Q46",{"$f":"\"\"","v":""},346015,null,null,"15096BAA",{"$f":"\"\"","v":""},{"$f":"\"\"","v":""},{"$f":"\"\"","v":""},"U","1",{"$f":"\"\"","v":""},{"$f":"\"\"","v":""},{"$f":"\"\"","v":""}]
["MT565","4","CAB","UM",12,99,null,null,{"$f":"\"\"","v":""},{"$f":"\"\"","v":""},{"$f":"\"\"","v":""},{"$f":"\"\"","v":""},{"$f":"\"\"","v":""},{"$f":"\"\"","v":""},"Q76",{"$f":"\"\"","v":""},320945,null,null,"15115BAA",{"$f":"\"\"","v":""},{"$f":"\"\"","v":""},{"$f":"\"\"","v":""},"L","2",{"$f":"\"\"","v":""},{"$f":"\"\"","v":""},{"$f":"\"\"","v":""}]
["Agrofarm 85, 100, 410, 420 and 430","2/4","Cab/Rops","DM",20,null,null,null,"X31","X41","X36","X46","Q31","Q41","Q36","Q46",14324585,null,null,"15154BAA","15154FCA",{"$f":"\"\"","v":""},{"$f":"\"\"","v":""},"L",4,{"$f":"\"\"","v":""},{"$f":"\"\"","v":""},{"$f":"\"\"","v":""}]
["Agrolux 45-75","4","ROPS","DM",102,null,null,null,"X21",{"$f":"\"\"","v":""},"X26",{"$f":"\"\"","v":""},{"$f":"\"\"","v":""},{"$f":"\"\"","v":""},{"$f":"\"\"","v":""},{"$f":"\"\"","v":""},14327165,null,null,"15183BAA",{"$f":"\"\"","v":""},{"$f":"\"\"","v":""},{"$f":"\"\"","v":""},"L",4,{"$f":"\"\"","v":""},{"$f":"\"\"","v":""},{"$f":"\"\"","v":""}]
["Agroplus 310,315,320 + Ecoline","4","Cab/Rops","DM",null,null,null,null,"X21","X31","X26","X36","Q21","Q31","Q26","Q36",14325495,null,null,"15184BAA",{"$f":"\"\"","v":""},{"$f":"\"\"","v":""},{"$f":"\"\"","v":""},"L",4,{"$f":"\"\"","v":""},{"$f":"\"\"","v":""},{"$f":"\"\"","v":""}]
["Agrolplus 410,420 + Ecoline","4","Cab/Rops","DM",null,null,null,null,"X21","X31","X26","X36","Q21","Q31","Q26","Q36",14325505,null,null,"15184BAA",{"$f":"\"\"","v":""},{"$f":"\"\"","v":""},{"$f":"\"\"","v":""},"L",4,{"$f":"\"\"","v":""},{"$f":"\"\"","v":""},{"$f":"\"\"","v":""}]
["Agrofarm TTV420 and TTV430 + Profiline","2/4","Cab/Rops",{"$f":"IF(E117=11,\"US\",\"DM\")","v":"DM"},20,null,null,null,"X31","X41","X36","X46","Q31","Q41","Q36","Q46",14324585,null,null,"15256BAA","15256FCA","10378316B",{"$f":"\"\"","v":""},{"$f":"IF(D117=\"US\",\"U\",\"L\")","v":"L"},{"$f":"IF(D117=\"DS\",\"3\",IF(D117=\"DM\",\"4\",IF(D117=\"US\",\"1\",IF(D117=\"UM\",\"2\",IF(D117=\"DL\",\"3\")))))","v":"4"},{"$f":"\"\"","v":""},{"$f":"\"\"","v":""},{"$f":"\"\"","v":""}]
["Agrofarm 410T and 420T","2/4","Rops","DM","",null,null,null,"X31","X41","X36","X46","Q31","Q41","Q36","Q46",14325335,null,null,"15154BAA","15154FCA",{"$f":"\"\"","v":""},{"$f":"\"\"","v":""},"L","4",{"$f":"\"\"","v":""},{"$f":"\"\"","v":""},{"$f":"\"\"","v":""}]
["Agrofarm 410TB and 420TB","2/4","Rops","DM","",null,null,null,"X31","X41","X36","X46","Q31","Q41","Q36","Q46",14325345,null,null,"15154BAA","15154FCA",{"$f":"\"\"","v":""},{"$f":"\"\"","v":""},"L","4",{"$f":"\"\"","v":""},{"$f":"\"\"","v":""},{"$f":"\"\"","v":""}]
["Agrotron K90-120, K410,420 and 430","4","Cab","DM",21,null,null,null,"X41","X51","X46","X56","Q41","Q51","Q46","Q56",14322824,null,null,"15032BAA","15032FCA",{"$f":"\"\"","v":""},{"$f":"\"\"","v":""},"L","4",{"$f":"\"\"","v":""},{"$f":"\"\"","v":""},{"$f":"\"\"","v":""}]
["Agrotron K90-120, K410,420, 430 (Profiline)","4","Cab","DM","",null,null,null,"X41","X51","X46","X56","Q41","Q51","Q46","Q56",14322824,null,null,{"$f":"\"\"","v":""},"15170FCA",{"$f":"\"\"","v":""},{"$f":"\"\"","v":""},"L","4",{"$f":"\"\"","v":""},{"$f":"\"\"","v":""},{"$f":"\"\"","v":""}]
["Agrotron K-110 and K-610","4","Cab","DM",21,null,null,null,{"$f":"\"\"","v":""},{"$f":"\"\"","v":""},{"$f":"\"\"","v":""},{"$f":"\"\"","v":""},"Q51","Q61","Q56","Q66",14322774,null,null,"15032BAA","15032FCA",{"$f":"\"\"","v":""},{"$f":"\"\"","v":""},"L","4",{"$f":"\"\"","v":""},{"$f":"\"\"","v":""},{"$f":"\"\"","v":""}]
["Agrotron K-110 & K-610 (Profiline)","4","Cab","DM","",null,null,null,{"$f":"\"\"","v":""},{"$f":"\"\"","v":""},{"$f":"\"\"","v":""},{"$f":"\"\"","v":""},"Q51","Q61","Q56","Q66",14322774,null,null,{"$f":"\"\"","v":""},"15170FCA",{"$f":"\"\"","v":""},{"$f":"\"\"","v":""},"L","4",{"$f":"\"\"","v":""},{"$f":"\"\"","v":""},{"$f":"\"\"","v":""}]
["Agrotron M410 and M420","4","Cab","DM",23,null,null,null,{"$f":"\"\"","v":""},{"$f":"\"\"","v":""},{"$f":"\"\"","v":""},{"$f":"\"\"","v":""},"Q51","Q61","Q56","Q66",14326744,null,null,"15010BAA","15010FCA",{"$f":"\"\"","v":""},{"$f":"\"\"","v":""},"L","4",{"$f":"\"\"","v":""},{"$f":"\"\"","v":""},{"$f":"\"\"","v":""}]
["Agrotron TTV 410, 420, 430 + Profiline","4","Cab","DM","",null,null,null,{"$f":"\"\"","v":""},{"$f":"\"\"","v":""},{"$f":"\"\"","v":""},{"$f":"\"\"","v":""},"Q51","Q61","Q56","Q66",14326744,null,null,{"$f":"\"\"","v":""},"15270FCC",{"$f":"\"\"","v":""},{"$f":"\"\"","v":""},"L","4",{"$f":"\"\"","v":""},{"$f":"\"\"","v":""},{"$f":"\"\"","v":""}]
["Agrotron M600 - M625 + Profiline","4","Cab","DM",24,null,null,null,{"$f":"\"\"","v":""},{"$f":"\"\"","v":""},{"$f":"\"\"","v":""},{"$f":"\"\"","v":""},"Q51","Q61","Q56","Q66",14324124,null,null,"15010BAA","15010FCA",{"$f":"\"\"","v":""},{"$f":"\"\"","v":""},"L","4",{"$f":"\"\"","v":""},{"$f":"\"\"","v":""},{"$f":"\"\"","v":""}]
["Agrotron M640","4","Cab","DM",23,null,null,null,{"$f":"\"\"","v":""},{"$f":"\"\"","v":""},{"$f":"\"\"","v":""},{"$f":"\"\"","v":""},"Q61",{"$f":"\"\"","v":""},"Q66","Q76",14324084,null,null,"15010BAA","15010FCA",{"$f":"\"\"","v":""},{"$f":"\"\"","v":""},"L","4",{"$f":"\"\"","v":""},{"$f":"\"\"","v":""},{"$f":"\"\"","v":""}]
["Agrotron M640 Profiline","4","Cab","DM","",null,null,null,{"$f":"\"\"","v":""},{"$f":"\"\"","v":""},{"$f":"\"\"","v":""},{"$f":"\"\"","v":""},"Q61",{"$f":"\"\"","v":""},"Q66","Q76",14324084,null,null,"15010BAA","15010FCA",{"$f":"\"\"","v":""},{"$f":"\"\"","v":""},"L","4",{"$f":"\"\"","v":""},{"$f":"\"\"","v":""},{"$f":"\"\"","v":""}]
["Agrotron TTV 610 and TTV 620","4","Cab","DM","",null,null,null,{"$f":"\"\"","v":""},{"$f":"\"\"","v":""},{"$f":"\"\"","v":""},{"$f":"\"\"","v":""},"Q61",{"$f":"\"\"","v":""},"Q66","Q76",14324084,null,null,{"$f":"\"\"","v":""},"15182FCA",{"$f":"\"\"","v":""},{"$f":"\"\"","v":""},"L","4",{"$f":"\"\"","v":""},{"$f":"\"\"","v":""},{"$f":"\"\"","v":""}]
["Agrotron M650","4","Cab","DM","",null,null,null,{"$f":"\"\"","v":""},{"$f":"\"\"","v":""},{"$f":"\"\"","v":""},{"$f":"\"\"","v":""},{"$f":"\"\"","v":""},{"$f":"\"\"","v":""},"Q76",{"$f":"\"\"","v":""},14324064,null,null,"15010BAA","15010FCA",{"$f":"\"\"","v":""},{"$f":"\"\"","v":""},"L","4",{"$f":"\"\"","v":""},{"$f":"\"\"","v":""},{"$f":"\"\"","v":""}]
["Agrotron M650 Profiline","4","Cab","DM","",null,null,null,{"$f":"\"\"","v":""},{"$f":"\"\"","v":""},{"$f":"\"\"","v":""},{"$f":"\"\"","v":""},{"$f":"\"\"","v":""},{"$f":"\"\"","v":""},"Q76",{"$f":"\"\"","v":""},14324064,null,null,"15010BAA","15010FCA",{"$f":"\"\"","v":""},{"$f":"\"\"","v":""},"L","4",{"$f":"\"\"","v":""},{"$f":"\"\"","v":""},{"$f":"\"\"","v":""}]
["Agrotron TTV 630, TTV7210, 7230, 7250","4","Cab","DL","",null,null,null,{"$f":"\"\"","v":""},{"$f":"\"\"","v":""},{"$f":"\"\"","v":""},{"$f":"\"\"","v":""},{"$f":"\"\"","v":""},{"$f":"\"\"","v":""},"Q88",{"$f":"\"\"","v":""},14331175,null,null,{"$f":"\"\"","v":""},"15254FCC",{"$f":"\"\"","v":""},{"$f":"\"\"","v":""},"L","3",{"$f":"\"\"","v":""},{"$f":"\"\"","v":""},{"$f":"\"\"","v":""}]
["5100 , 5110, 5120, 5130","4","Cab/Rops","DM",26,null,null,null,"X41","X51","X46","X56","Q41","Q51","Q46","Q56",14326664,null,null,"15317BAA",{"$f":"\"\"","v":""},{"$f":"\"\"","v":""},{"$f":"\"\"","v":""},"L","4",{"$f":"\"\"","v":""},{"$f":"\"\"","v":""},{"$f":"\"\"","v":""}]
["5100 , 5110, 5120, 5130 Profiline and TTV","4","Cab/Rops","DM",25,26,null,null,"X41","X51","X46","X56","Q41","Q51","Q46","Q56",14326664,null,null,"15340BAA",{"$f":"\"\"","v":""},{"$f":"\"\"","v":""},{"$f":"\"\"","v":""},"L","4",{"$f":"\"\"","v":""},{"$f":"\"\"","v":""},{"$f":"\"\"","v":""}]
["Agrotron 6150, 6160 ","4","Cab","DM",24,26,27,null,{"$f":"\"\"","v":""},{"$f":"\"\"","v":""},{"$f":"\"\"","v":""},{"$f":"\"\"","v":""},"Q51","Q61","Q56","Q66",14326394,null,null,"15270BAC","15270FCC",{"$f":"\"\"","v":""},{"$f":"\"\"","v":""},"L","4",{"$f":"\"\"","v":""},{"$f":"\"\"","v":""},{"$f":"\"\"","v":""}]
["Agrotron 6150, 6160 Profiline and TTV","4","Cab","DM",27,null,null,null,{"$f":"\"\"","v":""},{"$f":"\"\"","v":""},{"$f":"\"\"","v":""},{"$f":"\"\"","v":""},"Q51","Q61","Q56","Q66",14326394,null,null,{"$f":"\"\"","v":""},"15270FCC","10378301B",{"$f":"\"\"","v":""},"L","4",{"$f":"\"\"","v":""},{"$f":"\"\"","v":""},{"$f":"\"\"","v":""}]
["Agrotron 6150.4, 6160.4","4","Cab","DM",24,26,27,null,"X41","X51","X46","X56","Q41","Q51","Q46","Q56",14327134,null,null,"15357BAC","15357FCC",{"$f":"\"\"","v":""},{"$f":"\"\"","v":""},"L","4",{"$f":"\"\"","v":""},{"$f":"\"\"","v":""},{"$f":"\"\"","v":""}]
["Agrotron 6150.4, 6160.4 Profiline and TTV","4","Cab","DM",27,null,null,null,"X41","X51","X46","X56","Q41","Q51","Q46","Q56",14327134,null,null,{"$f":"\"\"","v":""},"15357FCC",{"$f":"\"\"","v":""},{"$f":"\"\"","v":""},"L","4",{"$f":"\"\"","v":""},{"$f":"\"\"","v":""},{"$f":"\"\"","v":""}]
["Agrotron 6180, 6190","4","Cab","DM",24,26,27,null,{"$f":"\"\"","v":""},{"$f":"\"\"","v":""},{"$f":"\"\"","v":""},{"$f":"\"\"","v":""},"Q61",{"$f":"\"\"","v":""},"Q66","Q76",14326304,null,null,"15342BAC","15342FCC",{"$f":"\"\"","v":""},{"$f":"\"\"","v":""},"L","4",{"$f":"\"\"","v":""},{"$f":"\"\"","v":""},{"$f":"\"\"","v":""}]
["Agrotron 6180, 6190  Profiline and TTV","4","Cab",{"$f":"IF(E140=11,\"US\",\"DM\")","v":"DM"},27,null,null,null,{"$f":"\"\"","v":""},{"$f":"\"\"","v":""},{"$f":"\"\"","v":""},{"$f":"\"\"","v":""},"Q61",{"$f":"\"\"","v":""},"Q66","Q76",14326304,null,null,{"$f":"\"\"","v":""},"15342FCC","10378301B",{"$f":"\"\"","v":""},{"$f":"IF(D140=\"US\",\"U\",\"L\")","v":"L"},{"$f":"IF(D140=\"DS\",\"3\",IF(D140=\"DM\",\"4\",IF(D140=\"US\",\"1\",IF(D140=\"UM\",\"2\",IF(D140=\"DL\",\"3\")))))","v":"4"},{"$f":"\"\"","v":""},{"$f":"\"\"","v":""},{"$f":"\"\"","v":""}]
["5045E, 5055E, 5065E, 5075E (Teir 3)","2/4","ROPS/CAB","DM",33,null,null,null,"X21","X31","X26","X36","Q21","Q31","Q26","Q36",14328604,null,null,"15178BAA",{"$f":"\"\"","v":""},"10378047D","10378277M'","L","4",{"$f":"\"\"","v":""},{"$f":"\"\"","v":""},{"$f":"\"\"","v":""}]
["5045E, 5055E, 5065E, 5075E (Teir 4)","2/4","ROPS/CAB","DM",null,null,null,null,"X21","X31","X26","X36","Q21","Q31","Q26","Q36",14328784,null,null,{"$f":"\"\"","v":""},{"$f":"\"\"","v":""},"10378420D",{"$f":"\"\"","v":""},"L","4",{"$f":"\"\"","v":""},{"$f":"\"\"","v":""},{"$f":"\"\"","v":""}]
["5085E, 5100E (Teir 3)","2/4","ROPS/CAB","DM",{"$f":"\"\"","v":""},null,null,null,"X31",{"$f":"\"\"","v":""},"X36",{"$f":"\"\"","v":""},"Q31",{"$f":"\"\"","v":""},"Q36",{"$f":"\"\"","v":""},14327084,null,null,{"$f":"\"\"","v":""},{"$f":"\"\"","v":""},"10378096D",{"$f":"\"\"","v":""},"L","4",{"$f":"\"\"","v":""},{"$f":"\"\"","v":""},{"$f":"\"\"","v":""}]
["5085E, 5100E  (Teir4)","2/4","ROPS/CAB","DM",{"$f":"\"\"","v":""},null,null,null,"X31",{"$f":"\"\"","v":""},"X36",{"$f":"\"\"","v":""},"Q31",{"$f":"\"\"","v":""},"Q36",{"$f":"\"\"","v":""},14328944,null,null,{"$f":"\"\"","v":""},{"$f":"\"\"","v":""},"10378420D",{"$f":"\"\"","v":""},"L","4",{"$f":"\"\"","v":""},{"$f":"\"\"","v":""},{"$f":"\"\"","v":""}]
["5083E, 5093E, 5101E, 5425, 5525, 5625, 5603","2/4","ROPS/CAB","DM",35,null,null,null,"X21","X31","X26","X36","Q21","Q31","Q26",{"$f":"\"\"","v":""},14325964,null,null,"15082BAA",{"$f":"\"\"","v":""},"10378047D","10378277M'","L","4",{"$f":"\"\"","v":""},{"$f":"\"\"","v":""},{"$f":"\"\"","v":""}]
["5065M, 5075M, 5085M (Teir 3&4)","2/4","ROPS/CAB","DM",{"$f":"\"\"","v":""},null,null,null,"X31",{"$f":"\"\"","v":""},"X36",{"$f":"\"\"","v":""},"Q31",{"$f":"\"\"","v":""},"Q36",{"$f":"\"\"","v":""},14325324,null,null,{"$f":"\"\"","v":""},{"$f":"\"\"","v":""},"10378047D","10378277M'","L","4",{"$f":"\"\"","v":""},{"$f":"\"\"","v":""},{"$f":"\"\"","v":""}]
["5095M, 5105M, 5100M, 5115M (Teir 3&4)","2/4","ROPS/CAB","DM",{"$f":"\"\"","v":""},null,null,null,"X31",{"$f":"\"\"","v":""},"X36",{"$f":"\"\"","v":""},"Q31",{"$f":"\"\"","v":""},"Q36",{"$f":"\"\"","v":""},14325324,null,null,{"$f":"\"\"","v":""},{"$f":"\"\"","v":""},"10378047D","10378277M'","L","4",{"$f":"\"\"","v":""},{"$f":"\"\"","v":""},{"$f":"\"\"","v":""}]
["6100D, 6115D, 6130D, 6140D","2/4","ROPS/CAB","DM",{"$f":"\"\"","v":""},null,null,null,"X41","X51","X46","X56","Q41","Q51","Q46","Q56",14324814,null,null,"15141BAA",{"$f":"\"\"","v":""},"10378047D","10378277M'","L","4",{"$f":"\"\"","v":""},{"$f":"\"\"","v":""},{"$f":"\"\"","v":""}]
["61105D, 6115D, 6130D, 60140D T4","2/4","ROPS/CAB",{"$f":"IF(E149=11,\"US\",\"DM\")","v":"DM"},{"$f":"\"\"","v":""},null,null,null,"X41","X51","X46","X56","Q41","Q51","Q46","Q56",14329094,null,null,{"$f":"\"\"","v":""},{"$f":"\"\"","v":""},"10378420D","10378277M'",{"$f":"IF(D149=\"US\",\"U\",\"L\")","v":"L"},{"$f":"IF(D149=\"DS\",\"3\",IF(D149=\"DM\",\"4\",IF(D149=\"US\",\"1\",IF(D149=\"UM\",\"2\",IF(D149=\"DL\",\"3\")))))","v":"4"},{"$f":"\"\"","v":""},{"$f":"\"\"","v":""},{"$f":"\"\"","v":""}]
["6105E, 6120E, 6135E T4F","2/4","ROPS/CAB","DM",{"$f":"\"\"","v":""},null,null,null,"X41","X51","X46","X56","Q41","Q51","Q46","Q56",14329094,null,null,{"$f":"\"\"","v":""},{"$f":"\"\"","v":""},"10378420D","10378277M'","L","4",{"$f":"\"\"","v":""},{"$f":"\"\"","v":""},{"$f":"\"\"","v":""}]
["6105M, 6115M, 6125M","2/4","ROPS/CAB","DM",106,null,null,null,{"$f":"\"\"","v":""},{"$f":"\"\"","v":""},{"$f":"\"\"","v":""},{"$f":"\"\"","v":""},"Q51","Q61","Q56","Q66",14328584,null,null,"15304BAA","15304FCA","10378435D","10378277M'","L","4",{"$f":"\"\"","v":""},{"$f":"\"\"","v":""},{"$f":"\"\"","v":""}]
["6105R, 6110R, 6115R,6120R, 6125R","2/4","ROPS/CAB","DM",106,null,null,null,{"$f":"\"\"","v":""},{"$f":"\"\"","v":""},{"$f":"\"\"","v":""},{"$f":"\"\"","v":""},"Q51","Q61","Q56","Q66",14328584,null,null,"15304BAA","15304FCA","10378435D","10378277M'","L","4",{"$f":"\"\"","v":""},{"$f":"\"\"","v":""},{"$f":"\"\"","v":""}]
["6130M, 6140M, 6150M","2/4","ROPS/CAB","DM",106,null,null,null,{"$f":"\"\"","v":""},{"$f":"\"\"","v":""},{"$f":"\"\"","v":""},{"$f":"\"\"","v":""},"Q61",{"$f":"\"\"","v":""},"Q66","Q76",14329024,null,null,"15304BAA","15304FCA","10378435D","10378277M'","L","4",{"$f":"\"\"","v":""},{"$f":"\"\"","v":""},{"$f":"\"\"","v":""}]
["6135M, 6145M, 6155M","2/4","ROPS/CAB",{"$f":"IF(E154=11,\"US\",\"DM\")","v":"DM"},106,null,null,null,{"$f":"\"\"","v":""},{"$f":"\"\"","v":""},{"$f":"\"\"","v":""},{"$f":"\"\"","v":""},"Q61",{"$f":"\"\"","v":""},"Q66","Q76",14329024,null,null,"15304BAA","15304FCA","10378435D","10378277M'",{"$f":"IF(D154=\"US\",\"U\",\"L\")","v":"L"},{"$f":"IF(D154=\"DS\",\"3\",IF(D154=\"DM\",\"4\",IF(D154=\"US\",\"1\",IF(D154=\"UM\",\"2\",IF(D154=\"DL\",\"3\")))))","v":"4"},{"$f":"\"\"","v":""},{"$f":"\"\"","v":""},{"$f":"\"\"","v":""}]
["6130R, 6140R, 6150R","2/4","ROPS/CAB","DM",106,null,null,null,{"$f":"\"\"","v":""},{"$f":"\"\"","v":""},{"$f":"\"\"","v":""},{"$f":"\"\"","v":""},"Q61",{"$f":"\"\"","v":""},"Q66","Q76",14329024,null,null,"15304BAA","15304FCA","10378435D","10378277M'","L","4",{"$f":"\"\"","v":""},{"$f":"\"\"","v":""},{"$f":"\"\"","v":""}]
["6135R, 6145R","2/4","ROPS/CAB","DM",106,null,null,null,{"$f":"\"\"","v":""},{"$f":"\"\"","v":""},{"$f":"\"\"","v":""},{"$f":"\"\"","v":""},"Q61",{"$f":"\"\"","v":""},"Q66","Q76",14329024,null,null,"15304BAA","15304FCA","10378435D","10378277M'","L","4",{"$f":"\"\"","v":""},{"$f":"\"\"","v":""},{"$f":"\"\"","v":""}]
["6170M, 6190M, 6210M","2/4","CAB","DM",106,null,null,null,{"$f":"\"\"","v":""},{"$f":"\"\"","v":""},{"$f":"\"\"","v":""},{"$f":"\"\"","v":""},{"$f":"\"\"","v":""},{"$f":"\"\"","v":""},"Q76",{"$f":"\"\"","v":""},14329034,null,null,"15406BAA","15406FCA","10378435D",{"$f":"\"\"","v":""},"L","4",{"$f":"\"\"","v":""},{"$f":"\"\"","v":""},{"$f":"\"\"","v":""}]
["6175M, 6195M, 6215M","2/4","CAB",{"$f":"IF(E158=11,\"US\",\"DM\")","v":"DM"},106,null,null,null,{"$f":"\"\"","v":""},{"$f":"\"\"","v":""},{"$f":"\"\"","v":""},{"$f":"\"\"","v":""},{"$f":"\"\"","v":""},{"$f":"\"\"","v":""},"Q76",{"$f":"\"\"","v":""},14329034,null,null,"15406BAA","15406FCA","10378435D",{"$f":"\"\"","v":""},{"$f":"IF(D158=\"US\",\"U\",\"L\")","v":"L"},{"$f":"IF(D158=\"DS\",\"3\",IF(D158=\"DM\",\"4\",IF(D158=\"US\",\"1\",IF(D158=\"UM\",\"2\",IF(D158=\"DL\",\"3\")))))","v":"4"},{"$f":"\"\"","v":""},{"$f":"\"\"","v":""},{"$f":"\"\"","v":""}]
["6170R, 6190R, 6210R","2/4","CAB","DM",106,null,null,null,{"$f":"\"\"","v":""},{"$f":"\"\"","v":""},{"$f":"\"\"","v":""},{"$f":"\"\"","v":""},{"$f":"\"\"","v":""},{"$f":"\"\"","v":""},"Q76",{"$f":"\"\"","v":""},14329034,null,null,"15406BAA","15406FCA","10378435D",{"$f":"\"\"","v":""},"L","4",{"$f":"\"\"","v":""},{"$f":"\"\"","v":""},{"$f":"\"\"","v":""}]
["6175R, 6195R, 6215R","2/4","CAB","DM",106,null,null,null,{"$f":"\"\"","v":""},{"$f":"\"\"","v":""},{"$f":"\"\"","v":""},{"$f":"\"\"","v":""},{"$f":"\"\"","v":""},{"$f":"\"\"","v":""},"Q76",{"$f":"\"\"","v":""},14329034,null,null,"15406BAA","15406FCA","10378435D",{"$f":"\"\"","v":""},"L","4",{"$f":"\"\"","v":""},{"$f":"\"\"","v":""},{"$f":"\"\"","v":""}]
["7200R, 7210R, 7215R, 7230R ","2/4","CAB","DL",{"$f":"\"\"","v":""},null,null,null,{"$f":"\"\"","v":""},{"$f":"\"\"","v":""},{"$f":"\"\"","v":""},{"$f":"\"\"","v":""},{"$f":"\"\"","v":""},{"$f":"\"\"","v":""},"Q88",{"$f":"\"\"","v":""},14331124,null,null,{"$f":"\"\"","v":""},"15292FCA"," 10378216D",{"$f":"\"\"","v":""},"L","3",{"$f":"\"\"","v":""},{"$f":"\"\"","v":""},{"$f":"\"\"","v":""}]
["7250R, 7260R, 7270R, 7280R, 7290R","2/4","CAB","DL",{"$f":"\"\"","v":""},null,null,null,{"$f":"\"\"","v":""},{"$f":"\"\"","v":""},{"$f":"\"\"","v":""},{"$f":"\"\"","v":""},{"$f":"\"\"","v":""},{"$f":"\"\"","v":""},"Q88",{"$f":"\"\"","v":""},14331124,null,null,{"$f":"\"\"","v":""},"15292FCA"," 10378216D",{"$f":"\"\"","v":""},"L","3",{"$f":"\"\"","v":""},{"$f":"\"\"","v":""},{"$f":"\"\"","v":""}]
["8245R, 8270R, 8295R, 8320R, 8335R, 8345R ","2/4","CAB","DXL",39,null,null,null,{"$f":"\"\"","v":""},{"$f":"\"\"","v":""},{"$f":"\"\"","v":""},{"$f":"\"\"","v":""},{"$f":"\"\"","v":""},{"$f":"\"\"","v":""},"Q98",{"$f":"\"\"","v":""},14340024,null,null,{"$f":"\"\"","v":""},"15258FCA",{"$f":"\"\"","v":""},{"$f":"\"\"","v":""},"L",0,{"$f":"\"\"","v":""},{"$f":"\"\"","v":""},{"$f":"\"\"","v":""}]
["5105, 5205","2/4","ROPS","DM",{"$f":"\"\"","v":""},null,null,null,"X21",{"$f":"\"\"","v":""},"X26",{"$f":"\"\"","v":""},"Q21",{"$f":"\"\"","v":""},"Q26",{"$f":"\"\"","v":""},14323464,null,null,"15139BAA",{"$f":"\"\"","v":""},{"$f":"\"\"","v":""},{"$f":"\"\"","v":""},"L","4",{"$f":"\"\"","v":""},{"$f":"\"\"","v":""},{"$f":"\"\"","v":""}]
["5103, 5203, 5303, 5403","2/4","ROPS","DM",{"$f":"\"\"","v":""},null,null,null,"X21",{"$f":"\"\"","v":""},"X26",{"$f":"\"\"","v":""},"Q21",{"$f":"\"\"","v":""},"Q26",{"$f":"\"\"","v":""},14323264,null,null,"15139BAA",{"$f":"\"\"","v":""},"10378047D","10378277M'","L","4",{"$f":"\"\"","v":""},{"$f":"\"\"","v":""},{"$f":"\"\"","v":""}]
["5225, 5325","2/4","ROPS/CAB","DM",31,32,null,null,"X21","X31","X26",{"$f":"\"\"","v":""},"Q21","Q31","Q26",{"$f":"\"\"","v":""},14324834,null,null,"15082BAA",{"$f":"\"\"","v":""},"10378047D","10378277M'","L","4",{"$f":"\"\"","v":""},{"$f":"\"\"","v":""},{"$f":"\"\"","v":""}]
["6403'","2/4","ROPS","DM",{"$f":"\"\"","v":""},null,null,null,"X41",{"$f":"\"\"","v":""},"X46",{"$f":"\"\"","v":""},"Q41",{"$f":"\"\"","v":""},"Q46",{"$f":"\"\"","v":""},14321415,null,null,"15138BAA",{"$f":"\"\"","v":""},{"$f":"\"\"","v":""},{"$f":"\"\"","v":""},"L","4",{"$f":"\"\"","v":""},{"$f":"\"\"","v":""},{"$f":"\"\"","v":""}]
["6603'","2/4","ROPS/CAB","DM",{"$f":"\"\"","v":""},null,null,null,"X51",{"$f":"\"\"","v":""},"X56",{"$f":"\"\"","v":""},"Q51",{"$f":"\"\"","v":""},"Q56",{"$f":"\"\"","v":""},14320385,null,null,"15138BAA",{"$f":"\"\"","v":""},{"$f":"\"\"","v":""},{"$f":"\"\"","v":""},"L","4",{"$f":"\"\"","v":""},{"$f":"\"\"","v":""},{"$f":"\"\"","v":""}]
["6000, 6100, 6200, 6300, 6400, 6405","2/4","ROPS/CAB","DM",null,null,null,null,"X41","X51","X46","X56","Q41","Q51","Q46","Q56",14320354,null,null,"15006BAA","15006FCA",{"$f":"\"\"","v":""},{"$f":"\"\"","v":""},"L","4",{"$f":"\"\"","v":""},{"$f":"\"\"","v":""},{"$f":"\"\"","v":""}]
["6010, 6110, 6210, 6310, 6410","2/4","ROPS/CAB","DM",null,null,null,null,"X41","X51","X46","X56","Q41","Q51","Q46","Q56",14320354,null,null,"15006BAA","15006FCA",{"$f":"\"\"","v":""},{"$f":"\"\"","v":""},"L","4",{"$f":"\"\"","v":""},{"$f":"\"\"","v":""},{"$f":"\"\"","v":""}]
["6215, 6415, 6120, 6220, 6320, 6420","2/4","ROPS/CAB","DM",28,29,null,null,"X41","X51","X46","X56","Q41","Q51","Q46","Q56",14324324,null,null,"15007BAA","15007FCA","10378047D","10378277M'","L","4",{"$f":"\"\"","v":""},{"$f":"\"\"","v":""},{"$f":"\"\"","v":""}]
["7200, 7300, 7400","2/4","ROPS/CAB","DM",{"$f":"\"\"","v":""},null,null,null,{"$f":"\"\"","v":""},{"$f":"\"\"","v":""},{"$f":"\"\"","v":""},{"$f":"\"\"","v":""},"Q51","Q61","Q56","Q66",14320364,null,null,"15137BAC",{"$f":"\"\"","v":""},"10378047D","10378277M'","L",4,{"$f":"\"\"","v":""},{"$f":"\"\"","v":""},{"$f":"\"\"","v":""}]
["7210, 7310, 7410, 7510, 6605, 7405","2/4","ROPS/CAB","DM",{"$f":"\"\"","v":""},null,null,null,{"$f":"\"\"","v":""},{"$f":"\"\"","v":""},{"$f":"\"\"","v":""},{"$f":"\"\"","v":""},"Q51","Q61","Q56","Q66",14320364,null,null,"15137BAC",{"$f":"\"\"","v":""},"10378047D","10378277M'","L","4",{"$f":"\"\"","v":""},{"$f":"\"\"","v":""},{"$f":"\"\"","v":""}]
["7600, 7700, 7800, 7610, 7710, 7810","2/4","CAB","DM",34,null,null,null,{"$f":"\"\"","v":""},{"$f":"\"\"","v":""},{"$f":"\"\"","v":""},{"$f":"\"\"","v":""},{"$f":"\"\"","v":""},{"$f":"\"\"","v":""},"Q76",{"$f":"\"\"","v":""},14320084,null,null,"15137BAC","15137FCC",{"$f":"\"\"","v":""},{"$f":"\"\"","v":""},"L",4,{"$f":"\"\"","v":""},{"$f":"\"\"","v":""},{"$f":"\"\"","v":""}]
["6615, 6715, 7220, 7320, 7420, 7520","2/4","ROPS/CAB","DM",29,null,null,null,{"$f":"\"\"","v":""},{"$f":"\"\"","v":""},{"$f":"\"\"","v":""},{"$f":"\"\"","v":""},"Q61",{"$f":"\"\"","v":""},"Q66",{"$f":"\"\"","v":""},14324334,null,null,"15007BAA","15007FCA","10378047D","10378277M'","L",4,{"$f":"\"\"","v":""},{"$f":"\"\"","v":""},{"$f":"\"\"","v":""}]
["6120L , 6220L, 6320L, 6420L, 6520L","2/4","ROPS/CAB","DM",29,null,null,null,"X51",{"$f":"\"\"","v":""},"X56",{"$f":"\"\"","v":""},"Q51",{"$f":"\"\"","v":""},"Q56",{"$f":"\"\"","v":""},14320374,null,null,"15007BAA","15007FCA","10378047D","10378277M'","L",4,{"$f":"\"\"","v":""},{"$f":"\"\"","v":""},{"$f":"\"\"","v":""}]
["6230L, 6330L, 6430L","2/4","ROPS/CAB","DM",29,null,null,null,"X51",{"$f":"\"\"","v":""},"X56",{"$f":"\"\"","v":""},"Q51",{"$f":"\"\"","v":""},"Q56",{"$f":"\"\"","v":""},14320374,null,null,"15007BAA","15007FCA","10378047D","10378277M'","L",4,{"$f":"\"\"","v":""},{"$f":"\"\"","v":""},{"$f":"\"\"","v":""}]
["6230, 6330, 6430","2/4","ROPS/CAB","DM",28,29,30,null,"X41","X51","X46","X56","Q41","Q51","Q46","Q56",14324324,null,null,"15005BAA","15005FCA","10378047D","10378277M'","L",4,{"$f":"\"\"","v":""},{"$f":"\"\"","v":""},{"$f":"\"\"","v":""}]
["7130, 7230, 7330","2/4","ROPS/CAB","DM",30,null,null,null,{"$f":"\"\"","v":""},{"$f":"\"\"","v":""},{"$f":"\"\"","v":""},{"$f":"\"\"","v":""},"Q61",{"$f":"\"\"","v":""},"Q66",{"$f":"\"\"","v":""},14324334,null,null,"15005BAA","15005FCA","10378047D","10378277M'","L",4,{"$f":"\"\"","v":""},{"$f":"\"\"","v":""},{"$f":"\"\"","v":""}]
["7430, 7530","2/4","ROPS/CAB","DM",29,30,null,null,{"$f":"\"\"","v":""},{"$f":"\"\"","v":""},{"$f":"\"\"","v":""},{"$f":"\"\"","v":""},{"$f":"\"\"","v":""},{"$f":"\"\"","v":""},"Q76",{"$f":"\"\"","v":""},14323414,null,null,"15005BAA","15005FCA","10378047D","10378277M'","L",4,{"$f":"\"\"","v":""},{"$f":"\"\"","v":""},{"$f":"\"\"","v":""}]
["7720, 7820, 7920, 7630, 7730, 7830, 7930","2/4","CAB","DL",{"$f":"\"\"","v":""},null,null,null,{"$f":"\"\"","v":""},{"$f":"\"\"","v":""},{"$f":"\"\"","v":""},{"$f":"\"\"","v":""},{"$f":"\"\"","v":""},{"$f":"\"\"","v":""},"Q88",{"$f":"\"\"","v":""},14330004,null,null,"15081BAA","15081FCA","10378216D",{"$f":"\"\"","v":""},"L",3,{"$f":"\"\"","v":""},{"$f":"\"\"","v":""},{"$f":"\"\"","v":""}]
["8100 - 8400, 8110 - 8410","2/4","CAB","DL",{"$f":"\"\"","v":""},null,null,null,{"$f":"\"\"","v":""},{"$f":"\"\"","v":""},{"$f":"\"\"","v":""},{"$f":"\"\"","v":""},{"$f":"\"\"","v":""},{"$f":"\"\"","v":""},"Q88",{"$f":"\"\"","v":""},14331034,null,null,"15201BAA","15201FCA",{"$f":"\"\"","v":""},{"$f":"\"\"","v":""},"L",3,{"$f":"\"\"","v":""},{"$f":"\"\"","v":""},{"$f":"\"\"","v":""}]
["2350, 2355 - 2750, 2755","2/4","ROPS/CAB","DM",41,10,null,null,"X31","X41","X46",{"$f":"\"\"","v":""},"Q31","Q41","Q46",{"$f":"\"\"","v":""},14324974,null,1,317059,{"$f":"\"\"","v":""},{"$f":"\"\"","v":""},{"$f":"\"\"","v":""},"L",4,1,{"$f":"\"\"","v":""},{"$f":"\"\"","v":""}]
["5220, 5320","2/4","ROPS/CAB","US",11,46,null,null,"X31",{"$f":"\"\"","v":""},"X36",{"$f":"\"\"","v":""},"Q21","Q31","Q26","Q36",10347344,null,1,10317565,{"$f":"\"\"","v":""},"10378047D",{"$f":"\"\"","v":""},"U","1",1,{"$f":"\"\"","v":""},{"$f":"\"\"","v":""}]
["5420, 5520","2/4","ROPS/CAB","US",11,46,null,null,"X31",{"$f":"\"\"","v":""},"X36",{"$f":"\"\"","v":""},"Q21","Q31","Q26","Q36",10347334,null,1,10317565,{"$f":"\"\"","v":""},"10378047D",{"$f":"\"\"","v":""},"U","1",1,{"$f":"\"\"","v":""},{"$f":"\"\"","v":""}]
["5200-5310, 5400","2/4","ROPS/CAB","US",11,45,46,47,"X31",{"$f":"\"\"","v":""},"X36",{"$f":"\"\"","v":""},"Q21","Q31","Q26","Q36",10347344,null,1,317275,{"$f":"\"\"","v":""},{"$f":"\"\"","v":""},{"$f":"\"\"","v":""},"U","1",1,{"$f":"\"\"","v":""},{"$f":"\"\"","v":""}]
["5410, 5500, 5510","2/4","ROPS/CAB","US",11,45,46,47,"X31",{"$f":"\"\"","v":""},"X36",{"$f":"\"\"","v":""},"Q21","Q31","Q26","Q36",10347334,null,1,317275,{"$f":"\"\"","v":""},{"$f":"\"\"","v":""},{"$f":"\"\"","v":""},"U","1",1,{"$f":"\"\"","v":""},{"$f":"\"\"","v":""}]
["5300N, 5310N, 5400N Narrow","2/4","CAB","US",11,46,48,49,{"$f":"\"\"","v":""},{"$f":"\"\"","v":""},{"$f":"\"\"","v":""},{"$f":"\"\"","v":""},"Q21",{"$f":"\"\"","v":""},"Q26",{"$f":"\"\"","v":""},10347344,null,1,317509,{"$f":"\"\"","v":""},{"$f":"\"\"","v":""},{"$f":"\"\"","v":""},"U","1",1,{"$f":"\"\"","v":""},{"$f":"\"\"","v":""}]
["5410N, 5500N, 5510N Narrow","2/4","CAB","US",11,46,48,49,{"$f":"\"\"","v":""},{"$f":"\"\"","v":""},{"$f":"\"\"","v":""},{"$f":"\"\"","v":""},"Q21",{"$f":"\"\"","v":""},"Q26",{"$f":"\"\"","v":""},10347334,null,1,317509,{"$f":"\"\"","v":""},{"$f":"\"\"","v":""},{"$f":"\"\"","v":""},"U","1",1,{"$f":"\"\"","v":""},{"$f":"\"\"","v":""}]
["5320N Narrow","2/4","CAB","US",11,46,49,null,{"$f":"\"\"","v":""},{"$f":"\"\"","v":""},{"$f":"\"\"","v":""},{"$f":"\"\"","v":""},"Q21",{"$f":"\"\"","v":""},"Q26",{"$f":"\"\"","v":""},10347344,null,1,10317565,{"$f":"\"\"","v":""},{"$f":"\"\"","v":""},{"$f":"\"\"","v":""},"U","1",1,{"$f":"\"\"","v":""},{"$f":"\"\"","v":""}]
["5420N, 5520N","2/4","CAB","US",11,46,49,null,{"$f":"\"\"","v":""},{"$f":"\"\"","v":""},{"$f":"\"\"","v":""},{"$f":"\"\"","v":""},"Q21",{"$f":"\"\"","v":""},"Q26",{"$f":"\"\"","v":""},10347334,null,1,10317565,{"$f":"\"\"","v":""},{"$f":"\"\"","v":""},{"$f":"\"\"","v":""},"U","1",1,{"$f":"\"\"","v":""},{"$f":"\"\"","v":""}]
["2150, 2155","2/4","ROPS/CAB","US",11,49,99,46,"X31",{"$f":"\"\"","v":""},"X36",{"$f":"\"\"","v":""},"Q31",{"$f":"\"\"","v":""},"Q36",{"$f":"\"\"","v":""},341384,null,1,317059,{"$f":"\"\"","v":""},{"$f":"\"\"","v":""},{"$f":"\"\"","v":""},"U","1",1,{"$f":"\"\"","v":""},{"$f":"\"\"","v":""}]
["2950, 2955 - 3255","2/4","ROPS/CAB","US",11,46,49,null,"X51",{"$f":"\"\"","v":""},"X56",{"$f":"\"\"","v":""},"Q51",{"$f":"\"\"","v":""},"Q56",{"$f":"\"\"","v":""},344955,null,1,317061,{"$f":"\"\"","v":""},{"$f":"\"\"","v":""},{"$f":"\"\"","v":""},"U","1",1,{"$f":"\"\"","v":""},{"$f":"\"\"","v":""}]
["4020'","2","ROPS/CAB","US",11,45,46,49,"X41",{"$f":"\"\"","v":""},"X46",{"$f":"\"\"","v":""},"Q41",{"$f":"\"\"","v":""},"Q46",{"$f":"\"\"","v":""},345275,null,1,317298,{"$f":"\"\"","v":""},{"$f":"\"\"","v":""},{"$f":"\"\"","v":""},"U","1",1,{"$f":"\"\"","v":""},{"$f":"\"\"","v":""}]
["4420, 4230, 4430, 4240, 4440","2","CAB","US",11,45,46,99,"X51",{"$f":"\"\"","v":""},"X56",{"$f":"\"\"","v":""},"Q51",{"$f":"\"\"","v":""},"Q56",{"$f":"\"\"","v":""},345285,null,1,317298,{"$f":"\"\"","v":""},{"$f":"\"\"","v":""},{"$f":"\"\"","v":""},"U","1",1,{"$f":"\"\"","v":""},{"$f":"\"\"","v":""}]
["4050/4055 -  4450/4455","2/4","CAB","UM",12,46,49,99,{"$f":"\"\"","v":""},{"$f":"\"\"","v":""},{"$f":"\"\"","v":""},{"$f":"\"\"","v":""},{"$f":"\"\"","v":""},{"$f":"\"\"","v":""},"Q56","Q66",320155,null,1,317146,{"$f":"\"\"","v":""},{"$f":"\"\"","v":""},{"$f":"\"\"","v":""},"L","2",1,{"$f":"\"\"","v":""},{"$f":"\"\"","v":""}]
["M5040-M7040, M5060-7060","2/4","ROPS/CAB","DM",50,null,null,null,"X21",{"$f":"\"\"","v":""},"X26",{"$f":"\"\"","v":""},"Q21",{"$f":"\"\"","v":""},"Q26",{"$f":"\"\"","v":""},14322734,null,null,"15203BEA","15203FCA",{"$f":"\"\"","v":""},{"$f":"\"\"","v":""},"L","4",null,{"$f":"\"\"","v":""},{"$f":"\"\"","v":""}]
["M5-091, 101","2/4","ROPS/CAB","DM",null,null,null,null,"X31",{"$f":"\"\"","v":""},"X36",{"$f":"\"\"","v":""},"Q31",{"$f":"\"\"","v":""},"Q36",{"$f":"\"\"","v":""},14328367,{"$f":"\"\"","v":""},{"$f":"\"\"","v":""},"15420BEA","15420FCA",{"$f":"\"\"","v":""},{"$f":"\"\"","v":""},{"$f":"IF(D198=\"US\",\"U\",\"L\")","v":"L"},{"$f":"IF(D198=\"DS\",\"3\",IF(D198=\"DM\",\"4\",IF(D198=\"US\",\"1\",IF(D198=\"UM\",\"2\",IF(D198=\"DL\",\"3\")))))","v":"4"},null,{"$f":"\"\"","v":""},{"$f":"\"\"","v":""}]
["M6-101, 111","2/4","ROPS/CAB","DM",null,null,null,null,"X41",{"$f":"\"\"","v":""},"X46",{"$f":"\"\"","v":""},"Q41",{"$f":"\"\"","v":""},"Q46",{"$f":"\"\"","v":""},14328277,{"$f":"\"\"","v":""},{"$f":"\"\"","v":""},"15421BAA","15421FCA",{"$f":"\"\"","v":""},{"$f":"\"\"","v":""},"L","4",null,{"$f":"\"\"","v":""},{"$f":"\"\"","v":""}]
["M6-131, 141","2/4","ROPS/CAB","DM",null,null,null,null,"X51",{"$f":"\"\"","v":""},"X56",{"$f":"\"\"","v":""},"Q51",{"$f":"\"\"","v":""},"Q56",{"$f":"\"\"","v":""},14328287,{"$f":"\"\"","v":""},{"$f":"\"\"","v":""},"15421BAA","15421FCA",{"$f":"\"\"","v":""},{"$f":"\"\"","v":""},"L","4",null,{"$f":"\"\"","v":""},{"$f":"\"\"","v":""}]
["M6S-111","2/4","ROPS/CAB",{"$f":"IF(E201=11,\"US\",\"DM\")","v":"DM"},null,null,null,null,"X41",{"$f":"\"\"","v":""},"X46",{"$f":"\"\"","v":""},"Q41",{"$f":"\"\"","v":""},"Q46",{"$f":"\"\"","v":""},14329257,{"$f":"\"\"","v":""},{"$f":"\"\"","v":""},"15476BEA",{"$f":"\"\"","v":""},{"$f":"\"\"","v":""},{"$f":"\"\"","v":""},{"$f":"IF(D201=\"US\",\"U\",\"L\")","v":"L"},{"$f":"IF(D201=\"DS\",\"3\",IF(D201=\"DM\",\"4\",IF(D201=\"US\",\"1\",IF(D201=\"UM\",\"2\",IF(D201=\"DL\",\"3\")))))","v":"4"},null,{"$f":"\"\"","v":""},{"$f":"\"\"","v":""}]
["M7-131, 151, 171","2/4","ROPS/CAB","DM","C5",{"$f":"\"\"","v":""},{"$f":"\"\"","v":""},{"$f":"\"\"","v":""},{"$f":"\"\"","v":""},{"$f":"\"\"","v":""},{"$f":"\"\"","v":""},{"$f":"\"\"","v":""},"Q51","Q61","Q56","Q66",14328824,{"$f":"\"\"","v":""},{"$f":"\"\"","v":""},"15421BAA","15421FCA",{"$f":"\"\"","v":""},{"$f":"\"\"","v":""},"L","4",null,{"$f":"\"\"","v":""},{"$f":"\"\"","v":""}]
["M8540, 9540","2/4","ROPS/CAB","DM",50,51,null,null,"X31",{"$f":"\"\"","v":""},"X36",{"$f":"\"\"","v":""},"Q31",{"$f":"\"\"","v":""},"Q36",{"$f":"\"\"","v":""},14322604,null,null,"15203BEA",{"$f":"\"\"","v":""},{"$f":"\"\"","v":""},{"$f":"\"\"","v":""},{"$f":"IF(D203=\"US\",\"U\",\"L\")","v":"L"},{"$f":"IF(D203=\"DS\",\"3\",IF(D203=\"DM\",\"4\",IF(D203=\"US\",\"1\",IF(D203=\"UM\",\"2\",IF(D203=\"DL\",\"3\")))))","v":"4"},null,{"$f":"\"\"","v":""},{"$f":"\"\"","v":""}]
["M8560, M9960 TIER 4I","2/4","ROPS/CAB","DM","",null,null,null,"X31",{"$f":"\"\"","v":""},"X36",{"$f":"\"\"","v":""},"Q31",{"$f":"\"\"","v":""},"Q36",{"$f":"\"\"","v":""},14322604,null,null,"15301BEA","15301FCA",{"$f":"\"\"","v":""},{"$f":"\"\"","v":""},"L","4",null,{"$f":"\"\"","v":""},{"$f":"\"\"","v":""}]
["M95S, M105S","2/4","CAB","DM","",null,null,null,"X31","X41","X36","X46","Q31","Q41","Q36","Q46",14321274,null,null,"15125BAA",{"$f":"\"\"","v":""},{"$f":"\"\"","v":""},{"$f":"\"\"","v":""},"L","4",null,{"$f":"\"\"","v":""},{"$f":"\"\"","v":""}]
["M96S, M108S","2/4","ROPS/CAB","DM",51,null,null,null,"X41",{"$f":"\"\"","v":""},"X46",{"$f":"\"\"","v":""},"Q41",{"$f":"\"\"","v":""},"Q46",{"$f":"\"\"","v":""},14323344,null,null,"15188BAA","15188FCA",{"$f":"\"\"","v":""},{"$f":"\"\"","v":""},"L","4",null,{"$f":"\"\"","v":""},{"$f":"\"\"","v":""}]
["M95X, M105X, M108X","2/4","CAB","DM","",null,null,null,"X41",{"$f":"\"\"","v":""},"X46",{"$f":"\"\"","v":""},"Q41",{"$f":"\"\"","v":""},"Q46",{"$f":"\"\"","v":""},14324194,null,null,"15188BAA","15188FCA",{"$f":"\"\"","v":""},{"$f":"\"\"","v":""},"L","4",null,{"$f":"\"\"","v":""},{"$f":"\"\"","v":""}]
["M100X, M110X","2/4","CAB","DM","",null,null,null,"X41",{"$f":"\"\"","v":""},"X46",{"$f":"\"\"","v":""},"Q41",{"$f":"\"\"","v":""},"Q46",{"$f":"\"\"","v":""},14324914,null,null,"15188BAA","15188FCA",{"$f":"\"\"","v":""},{"$f":"\"\"","v":""},"L","4",null,{"$f":"\"\"","v":""},{"$f":"\"\"","v":""}]
["M110, M120","2/4","CAB","DM","",null,null,null,"X51",{"$f":"\"\"","v":""},"X56",{"$f":"\"\"","v":""},"Q51",{"$f":"\"\"","v":""},"Q56",{"$f":"\"\"","v":""},14321234,null,null,"15133BAA",{"$f":"\"\"","v":""},{"$f":"\"\"","v":""},{"$f":"\"\"","v":""},"L","4",null,{"$f":"\"\"","v":""},{"$f":"\"\"","v":""}]
["M125X","2/4","CAB","DM","",null,null,null,"X51",{"$f":"\"\"","v":""},"X56",{"$f":"\"\"","v":""},"Q51",{"$f":"\"\"","v":""},"Q56",{"$f":"\"\"","v":""},14321234,null,null,"15188BAA","15188FCA",{"$f":"\"\"","v":""},{"$f":"\"\"","v":""},"L","4",null,{"$f":"\"\"","v":""},{"$f":"\"\"","v":""}]
["M126X, M135X","2/4","CAB","DM","",null,null,null,"X51",{"$f":"\"\"","v":""},"X56",{"$f":"\"\"","v":""},"Q51",{"$f":"\"\"","v":""},"Q56",{"$f":"\"\"","v":""},14324684,null,null,"15188BAA","15188FCA",{"$f":"\"\"","v":""},{"$f":"\"\"","v":""},"L","4",null,{"$f":"\"\"","v":""},{"$f":"\"\"","v":""}]
["M100GXDTCC, M110GXDTCC","2/4","CAB","DM","",null,null,null,"X41",{"$f":"\"\"","v":""},"X46",{"$f":"\"\"","v":""},"Q41",{"$f":"\"\"","v":""},"Q46",{"$f":"\"\"","v":""},14326374,null,null,"15297BAA","15297FCA",{"$f":"\"\"","v":""},{"$f":"\"\"","v":""},"L","4",null,{"$f":"\"\"","v":""},{"$f":"\"\"","v":""}]
["M126GXDTCC, M135GXDTCC","2/4","CAB","DM","",null,null,null,"X51",{"$f":"\"\"","v":""},"X56",{"$f":"\"\"","v":""},"Q51",{"$f":"\"\"","v":""},"Q56",{"$f":"\"\"","v":""},14326104,null,null,"15297BAA","15297FCA",{"$f":"\"\"","v":""},{"$f":"\"\"","v":""},"L","4",null,{"$f":"\"\"","v":""},{"$f":"\"\"","v":""}]
["M47/49/54/57/6800 ROPS","2/4","ROPS","DM","",null,null,null,"X21",{"$f":"\"\"","v":""},"X26",{"$f":"\"\"","v":""},"Q21",{"$f":"\"\"","v":""},"Q26",{"$f":"\"\"","v":""},14321504,null,null,"15132BAA",{"$f":"\"\"","v":""},{"$f":"\"\"","v":""},{"$f":"\"\"","v":""},"L","4",null,{"$f":"\"\"","v":""},{"$f":"\"\"","v":""}]
["M47/49/54/57/6800 CAB","2/4","CAB","DM","",null,null,null,"X21",{"$f":"\"\"","v":""},"X26",{"$f":"\"\"","v":""},"Q21",{"$f":"\"\"","v":""},"Q26",{"$f":"\"\"","v":""},14321504,null,null,"15126BAA",{"$f":"\"\"","v":""},{"$f":"\"\"","v":""},{"$f":"\"\"","v":""},"L","4",null,{"$f":"\"\"","v":""},{"$f":"\"\"","v":""}]
["M8200, M9000 ROPS","2/4","ROPS","DM",null,51,null,null,"X31",{"$f":"\"\"","v":""},"X36",{"$f":"\"\"","v":""},"Q31",{"$f":"\"\"","v":""},"Q36",{"$f":"\"\"","v":""},14321714,null,null,"15129BAA",{"$f":"\"\"","v":""},{"$f":"\"\"","v":""},{"$f":"\"\"","v":""},"L","4",null,{"$f":"\"\"","v":""},{"$f":"\"\"","v":""}]
["M8200, M9000 CAB","2/4","CAB","DM",null,null,null,null,"X31",{"$f":"\"\"","v":""},"X36",{"$f":"\"\"","v":""},"Q31",{"$f":"\"\"","v":""},"Q36",{"$f":"\"\"","v":""},14321714,null,null,"15126BAA",{"$f":"\"\"","v":""},{"$f":"\"\"","v":""},{"$f":"\"\"","v":""},"L","4",null,{"$f":"\"\"","v":""},{"$f":"\"\"","v":""}]
["M8200 Narrow SDNBC","4","CAB","US",11,46,52,99,{"$f":"\"\"","v":""},{"$f":"\"\"","v":""},{"$f":"\"\"","v":""},{"$f":"\"\"","v":""},"Q21",{"$f":"\"\"","v":""},"Q26",{"$f":"\"\"","v":""},10347004,null,1,317503,{"$f":"\"\"","v":""},{"$f":"\"\"","v":""},{"$f":"\"\"","v":""},"U","1",1,{"$f":"\"\"","v":""},{"$f":"\"\"","v":""}]
["M100 DTC","4","CAB","US",11,53,99,null,"X41",{"$f":"\"\"","v":""},"X46",{"$f":"\"\"","v":""},"Q41",{"$f":"\"\"","v":""},"Q46",{"$f":"\"\"","v":""},10347444,null,null,"15133BAA",{"$f":"\"\"","v":""},{"$f":"\"\"","v":""},{"$f":"\"\"","v":""},"U","1",null,{"$f":"\"\"","v":""},{"$f":"\"\"","v":""}]
["Alpine 70,80,85 Tier 3 STD /  GT","4","ROPS/CAB","DM",99,null,null,null,"X21","X31","X26","X36","Q21","Q31","Q26","Q36",14324905,null,null,"15056BAA",null,{"$f":"\"\"","v":""},{"$f":"\"\"","v":""},"L","4",null,{"$f":"\"\"","v":""},{"$f":"\"\"","v":""}]
["Powerfarm 60 TIER 2","4","ROPS/CAB","DM",99,null,null,null,"X31",{"$f":"\"\"","v":""},"X36",{"$f":"\"\"","v":""},"Q31",{"$f":"\"\"","v":""},"Q36",{"$f":"\"\"","v":""},14322105,null,null,"15198BAA",{"$f":"\"\"","v":""},{"$f":"\"\"","v":""},{"$f":"\"\"","v":""},"L","4",null,{"$f":"\"\"","v":""},{"$f":"\"\"","v":""}]
["Powerfarm 75-105 TIER 2 & 90-110 TIER 3","4","ROPS/CAB","DM","",null,null,null,"X31","X41","X36","X46","Q31","Q41","Q36","Q46",14324755,null,null,"15199BAA",{"$f":"\"\"","v":""},{"$f":"\"\"","v":""},{"$f":"\"\"","v":""},"L","4",null,{"$f":"\"\"","v":""},{"$f":"\"\"","v":""}]
["5-090H, 5-100H, 5-110H","2/4","ROPS/CAB","DM","",null,null,null,"X31",{"$f":"\"\"","v":""},"X36",{"$f":"\"\"","v":""},"Q31",{"$f":"\"\"","v":""},"Q36",{"$f":"\"\"","v":""},14325925,null,null,"15199BAA",{"$f":"\"\"","v":""},{"$f":"\"\"","v":""},{"$f":"\"\"","v":""},"L","4",null,{"$f":"\"\"","v":""},{"$f":"\"\"","v":""}]
["Vision 80, 85, 90 TIER 2","4","ROPS/CAB",{"$f":"IF(E224=11,\"US\",\"DM\")","v":"DM"},99,null,null,null,"X31","X41","X36","X46","Q31","Q41","Q36","Q46",14324795,null,null,"15064BAA",{"$f":"\"\"","v":""},{"$f":"\"\"","v":""},{"$f":"\"\"","v":""},"L","4",null,{"$f":"\"\"","v":""},{"$f":"\"\"","v":""}]
["Vision 95 - 105 TIER 2 & 3","4","ROPS/CAB","DM",99,null,null,null,"X41","X51","X46","X56","Q41","Q51","Q46","Q56",14324795,null,null,"15064BAA",{"$f":"\"\"","v":""},{"$f":"\"\"","v":""},{"$f":"\"\"","v":""},"L","4",null,{"$f":"\"\"","v":""},{"$f":"\"\"","v":""}]
["Powermondial 100, 105, 115","4","CAB","DM",99,null,null,null,"X41","X51","X46","X56","Q41","Q51","Q46","Q56",14324615,null,null,"15042BAA",{"$f":"\"\"","v":""},{"$f":"\"\"","v":""},{"$f":"\"\"","v":""},"L","4",null,{"$f":"\"\"","v":""},{"$f":"\"\"","v":""}]
["Landpower 125, 135 TIER 2","4","CAB","DM",99,null,null,null,{"$f":"\"\"","v":""},{"$f":"\"\"","v":""},{"$f":"\"\"","v":""},{"$f":"\"\"","v":""},"Q61",{"$f":"\"\"","v":""},"Q66",{"$f":"\"\"","v":""},14323605,null,null,"15072BAA",{"$f":"\"\"","v":""},{"$f":"\"\"","v":""},{"$f":"\"\"","v":""},"L","4",null,{"$f":"\"\"","v":""},{"$f":"\"\"","v":""}]
["Landpower 145 TIER 2","4","CAB","DM",99,null,null,null,{"$f":"\"\"","v":""},{"$f":"\"\"","v":""},{"$f":"\"\"","v":""},{"$f":"\"\"","v":""},"Q61",{"$f":"\"\"","v":""},"Q66",{"$f":"\"\"","v":""},14323025,null,null,"15072BAA",{"$f":"\"\"","v":""},{"$f":"\"\"","v":""},{"$f":"\"\"","v":""},"L","4",null,{"$f":"\"\"","v":""},{"$f":"\"\"","v":""}]
["Landpower 165, 185 TIER 2","4","CAB","DM",99,null,null,null,{"$f":"\"\"","v":""},{"$f":"\"\"","v":""},{"$f":"\"\"","v":""},{"$f":"\"\"","v":""},{"$f":"\"\"","v":""},{"$f":"\"\"","v":""},"Q76",{"$f":"\"\"","v":""},14323025,null,null,"15072BAA",{"$f":"\"\"","v":""},{"$f":"\"\"","v":""},{"$f":"\"\"","v":""},"L","4",null,{"$f":"\"\"","v":""},{"$f":"\"\"","v":""}]
["Landpower 125, 135 TIER 3","4","CAB","DM",99,null,null,null,{"$f":"\"\"","v":""},{"$f":"\"\"","v":""},{"$f":"\"\"","v":""},{"$f":"\"\"","v":""},"Q61",{"$f":"\"\"","v":""},"Q66",{"$f":"\"\"","v":""},14324155,null,null,"15072BAA",{"$f":"\"\"","v":""},{"$f":"\"\"","v":""},{"$f":"\"\"","v":""},"L","4",null,{"$f":"\"\"","v":""},{"$f":"\"\"","v":""}]
["Landpower 145 TIER 3","4","CAB","DM",54,99,null,null,{"$f":"\"\"","v":""},{"$f":"\"\"","v":""},{"$f":"\"\"","v":""},{"$f":"\"\"","v":""},"Q61",{"$f":"\"\"","v":""},"Q66",{"$f":"\"\"","v":""},14324465,null,null,"15072BAA",{"$f":"\"\"","v":""},{"$f":"\"\"","v":""},{"$f":"\"\"","v":""},"L","4",null,{"$f":"\"\"","v":""},{"$f":"\"\"","v":""}]
["Landpower 165, 185 TIER 3","4","CAB","DM",54,99,null,null,{"$f":"\"\"","v":""},{"$f":"\"\"","v":""},{"$f":"\"\"","v":""},{"$f":"\"\"","v":""},{"$f":"\"\"","v":""},{"$f":"\"\"","v":""},"Q76",{"$f":"\"\"","v":""},14324465,null,null,"15072BAA",{"$f":"\"\"","v":""},{"$f":"\"\"","v":""},{"$f":"\"\"","v":""},"L","4",null,{"$f":"\"\"","v":""},{"$f":"\"\"","v":""}]
["Rex 75, 85, 95, 105 F/GE Tier 2","4","ROPS/CAB","DS",4,99,103,null,{"$f":"\"\"","v":""},{"$f":"\"\"","v":""},{"$f":"\"\"","v":""},{"$f":"\"\"","v":""},"Q21",{"$f":"\"\"","v":""},"Q26",{"$f":"\"\"","v":""},14310665,null,null,"15066BAA",{"$f":"\"\"","v":""},{"$f":"\"\"","v":""},{"$f":"\"\"","v":""},"L","3",null,{"$f":"\"\"","v":""},{"$f":"\"\"","v":""}]
["Rex 80, 90, 100, 110 F/GE Tier 3","4","ROPS/CAB","DS",4,99,103,null,{"$f":"\"\"","v":""},{"$f":"\"\"","v":""},{"$f":"\"\"","v":""},{"$f":"\"\"","v":""},"Q21",{"$f":"\"\"","v":""},"Q26",{"$f":"\"\"","v":""},14310665,null,null,"15253BAA",{"$f":"\"\"","v":""},{"$f":"\"\"","v":""},{"$f":"\"\"","v":""},"L","3",null,{"$f":"\"\"","v":""},{"$f":"\"\"","v":""}]
["5865 ROPS","2","ROPS ","DM",99,null,null,null,"X21",{"$f":"\"\"","v":""},"X26",{"$f":"\"\"","v":""},"Q21",{"$f":"\"\"","v":""},"Q26",{"$f":"\"\"","v":""},14323575,null,null,"15068BAA",{"$f":"\"\"","v":""},{"$f":"\"\"","v":""},{"$f":"\"\"","v":""},"L","4",null,{"$f":"\"\"","v":""},{"$f":"\"\"","v":""}]
["6865, 8865","2/4","ROPS","DM",99,null,null,null,"X31","X41","X36","X46","Q31","Q41","Q36","Q46",14322765,null,null,"15068BAA",{"$f":"\"\"","v":""},{"$f":"\"\"","v":""},{"$f":"\"\"","v":""},"L","4",null,{"$f":"\"\"","v":""},{"$f":"\"\"","v":""}]
["Mythos 90, 100, 105","4","CAB","DM",99,null,null,null,"X41","X51","X46","X56","Q41","Q51","Q46","Q56",14323015,null,null,"15069BAC",{"$f":"\"\"","v":""},{"$f":"\"\"","v":""},{"$f":"\"\"","v":""},"L","4",null,{"$f":"\"\"","v":""},{"$f":"\"\"","v":""}]
["Mythos 115","4","CAB","DM",99,null,null,null,{"$f":"\"\"","v":""},{"$f":"\"\"","v":""},{"$f":"\"\"","v":""},{"$f":"\"\"","v":""},"Q51","Q61","Q56","Q66",14320285,null,null,"15069BAC",{"$f":"\"\"","v":""},{"$f":"\"\"","v":""},{"$f":"\"\"","v":""},"L","4",null,{"$f":"\"\"","v":""},{"$f":"\"\"","v":""}]
["Legend 115-135 NG","4","CAB","DM",54,55,99,null,{"$f":"\"\"","v":""},{"$f":"\"\"","v":""},{"$f":"\"\"","v":""},{"$f":"\"\"","v":""},"Q61",{"$f":"\"\"","v":""},"Q66","Q76",14320265,null,null,"15071BAA",{"$f":"\"\"","v":""},{"$f":"\"\"","v":""},{"$f":"\"\"","v":""},"L","4",null,{"$f":"\"\"","v":""},{"$f":"\"\"","v":""}]
["Legend 140 - 185 NG","4","CAB","DM",54,55,99,null,{"$f":"\"\"","v":""},{"$f":"\"\"","v":""},{"$f":"\"\"","v":""},{"$f":"\"\"","v":""},"Q61",{"$f":"\"\"","v":""},"Q66","Q76",14320275,null,null,"15071BAA",{"$f":"\"\"","v":""},{"$f":"\"\"","v":""},{"$f":"\"\"","v":""},"L","4",null,{"$f":"\"\"","v":""},{"$f":"\"\"","v":""}]
["6860 Evolution, 65 Blizzard","2/4","ROPS/CAB","US",11,46,99,null,"X31",{"$f":"\"\"","v":""},"X36",{"$f":"\"\"","v":""},"Q31",{"$f":"\"\"","v":""},"Q36",{"$f":"\"\"","v":""},343635,null,1,317215,{"$f":"\"\"","v":""},{"$f":"\"\"","v":""},{"$f":"\"\"","v":""},"U","1",1,{"$f":"\"\"","v":""},{"$f":"\"\"","v":""}]
["8860 Evolution, 85 Blizzard","2/4","ROPS/CAB","US",11,46,99,null,"X31","X41","X36","X46","Q31","Q41","Q36","Q46",343635,null,1,317215,{"$f":"\"\"","v":""},{"$f":"\"\"","v":""},{"$f":"\"\"","v":""},"U","1",1,{"$f":"\"\"","v":""},{"$f":"\"\"","v":""}]
["Ghibli 80, 90, 100","2/4","ROPS/CAB","US",11,46,99,null,"X41",{"$f":"\"\"","v":""},"X46",{"$f":"\"\"","v":""},"Q41",{"$f":"\"\"","v":""},"Q46",{"$f":"\"\"","v":""},346525,null,1,10317560,{"$f":"\"\"","v":""},{"$f":"\"\"","v":""},{"$f":"\"\"","v":""},"U","1",1,{"$f":"\"\"","v":""},{"$f":"\"\"","v":""}]
["6880, 7880, 8880, 9880","2/4","CAB","US",11,46,99,null,"X31","X41","X36","X46","Q31","Q41","Q36","Q46",343605,null,1,317215,{"$f":"\"\"","v":""},{"$f":"\"\"","v":""},{"$f":"\"\"","v":""},"U","1",1,{"$f":"\"\"","v":""},{"$f":"\"\"","v":""}]
["Rex 70, 80, 90, 100 F, L, GT (Not Tier 3)","2/4","ROPS/CAB","US",11,46,56,99,{"$f":"\"\"","v":""},{"$f":"\"\"","v":""},{"$f":"\"\"","v":""},{"$f":"\"\"","v":""},"Q21",{"$f":"\"\"","v":""},"Q26",{"$f":"\"\"","v":""},346194,null,1,10317536,{"$f":"\"\"","v":""},{"$f":"\"\"","v":""},{"$f":"\"\"","v":""},"U","1",1,{"$f":"\"\"","v":""},{"$f":"\"\"","v":""}]
["Advantage 65, 75, 85 F & S","4","CAB","US",11,46,99,null,{"$f":"\"\"","v":""},{"$f":"\"\"","v":""},{"$f":"\"\"","v":""},{"$f":"\"\"","v":""},"Q21",{"$f":"\"\"","v":""},"Q26",{"$f":"\"\"","v":""},346194,null,1,317185,{"$f":"\"\"","v":""},{"$f":"\"\"","v":""},{"$f":"\"\"","v":""},"U","1",1,{"$f":"\"\"","v":""},{"$f":"\"\"","v":""}]
["Advantage 65, 75, 85 F & S","4","ROPS","US",11,46,99,null,{"$f":"\"\"","v":""},{"$f":"\"\"","v":""},{"$f":"\"\"","v":""},{"$f":"\"\"","v":""},"Q21",{"$f":"\"\"","v":""},"Q26",{"$f":"\"\"","v":""},346194,null,1,317081,{"$f":"\"\"","v":""},{"$f":"\"\"","v":""},{"$f":"\"\"","v":""},"U","1",1,{"$f":"\"\"","v":""},{"$f":"\"\"","v":""}]
["5425,35 Tier 2 & 3 Dyna IV (Perkins)","2/4","ROPS/CAB","DM",58,59,60,null,"X31","X41","X36","X46","Q31","Q41","Q36","Q46",14324425,{"$f":"\"\"","v":""},{"$f":"\"\"","v":""},"15013BFA",{"$f":"\"\"","v":""},"10378252A",{"$f":"\"\"","v":""},{"$f":"IF(D248=\"US\",\"U\",\"L\")","v":"L"},{"$f":"IF(D248=\"DS\",\"3\",IF(D248=\"DM\",\"4\",IF(D248=\"US\",\"1\",IF(D248=\"UM\",\"2\",IF(D248=\"DL\",\"3\")))))","v":"4"},null,{"$f":"\"\"","v":""},{"$f":"\"\"","v":""}]
["5445,55,60 Tier 2 & 3 Dyna IV (Perkins)","2/4","ROPS/CAB","DM",58,null,60,null,"X41",{"$f":"\"\"","v":""},"X46",{"$f":"\"\"","v":""},"Q41",{"$f":"\"\"","v":""},"Q46",{"$f":"\"\"","v":""},14324425,{"$f":"\"\"","v":""},{"$f":"\"\"","v":""},"15013BFA",{"$f":"\"\"","v":""},"10378252A",{"$f":"\"\"","v":""},"L","4",null,{"$f":"\"\"","v":""},{"$f":"\"\"","v":""}]
["5425, 35, 45, 55, 60 with Speed Shift ","2/4","ROPS/CAB","DM",58,59,60,null,"X31","X41","X36","X46","Q31","Q41","Q36","Q46",14322625,{"$f":"\"\"","v":""},{"$f":"\"\"","v":""},"15013BFA",{"$f":"\"\"","v":""},"10378252A",{"$f":"\"\"","v":""},{"$f":"IF(D250=\"US\",\"U\",\"L\")","v":"L"},{"$f":"IF(D250=\"DS\",\"3\",IF(D250=\"DM\",\"4\",IF(D250=\"US\",\"1\",IF(D250=\"UM\",\"2\",IF(D250=\"DL\",\"3\")))))","v":"4"},null,{"$f":"\"\"","v":""},{"$f":"\"\"","v":""}]
["5460 Teir 3 DynaIV (SISU)","2/4","CAB","DM",null,60,61,null,{"$f":"\"\"","v":""},{"$f":"\"\"","v":""},{"$f":"\"\"","v":""},{"$f":"\"\"","v":""},"Q51","Q61","Q56","Q66",14324855,{"$f":"\"\"","v":""},{"$f":"\"\"","v":""},"15013BFA",{"$f":"\"\"","v":""},"10378252A",{"$f":"\"\"","v":""},"L","4",null,{"$f":"\"\"","v":""},{"$f":"\"\"","v":""}]
["5465 with Speed Shift TIER 2","2/4","CAB","DM",null,60,61,null,{"$f":"\"\"","v":""},{"$f":"\"\"","v":""},{"$f":"\"\"","v":""},{"$f":"\"\"","v":""},"Q51","Q61","Q56","Q66",14320455,{"$f":"\"\"","v":""},{"$f":"\"\"","v":""},"15013BFA",{"$f":"\"\"","v":""},"10378252A",{"$f":"\"\"","v":""},"L","4",null,{"$f":"\"\"","v":""},{"$f":"\"\"","v":""}]
["5465 with DYNA IV TIER 2","2/4","CAB","DM",null,60,61,null,{"$f":"\"\"","v":""},{"$f":"\"\"","v":""},{"$f":"\"\"","v":""},{"$f":"\"\"","v":""},"Q51","Q61","Q56","Q66",14321305,{"$f":"\"\"","v":""},{"$f":"\"\"","v":""},"15013BFA",{"$f":"\"\"","v":""},"10378252A",{"$f":"\"\"","v":""},"L","4",null,{"$f":"\"\"","v":""},{"$f":"\"\"","v":""}]
["5465,75 Teir 3 Dyna IV (Perkins)","2/4","CAB","DM",{"$f":"\"\"","v":""},null,null,104,{"$f":"\"\"","v":""},{"$f":"\"\"","v":""},{"$f":"\"\"","v":""},{"$f":"\"\"","v":""},"Q51","Q61","Q56","Q66",14322155,{"$f":"\"\"","v":""},{"$f":"\"\"","v":""},"15013BFA",{"$f":"\"\"","v":""},"10378252A",{"$f":"\"\"","v":""},"L","4",null,{"$f":"\"\"","v":""},{"$f":"\"\"","v":""}]
["5465,75 Teir 3 Dyna IV (SISU)","2/4","CAB","DM",{"$f":"\"\"","v":""},null,null,104,{"$f":"\"\"","v":""},{"$f":"\"\"","v":""},{"$f":"\"\"","v":""},{"$f":"\"\"","v":""},"Q51","Q61","Q56","Q66",14326245,{"$f":"\"\"","v":""},{"$f":"\"\"","v":""},"15013BFA",{"$f":"\"\"","v":""},"10378252A",{"$f":"\"\"","v":""},"L","4",null,{"$f":"\"\"","v":""},{"$f":"\"\"","v":""}]
["6465, 75, 80 with DYNA Shift TIER 2","2/4","CAB","DM",62,63,64,104,{"$f":"\"\"","v":""},{"$f":"\"\"","v":""},{"$f":"\"\"","v":""},{"$f":"\"\"","v":""},"Q61",{"$f":"\"\"","v":""},"Q66",{"$f":"\"\"","v":""},14320395,null,null,"15020BAA",{"$f":"\"\"","v":""},{"$f":"\"\"","v":""}," 10378270C","L","4",null,{"$f":"\"\"","v":""},{"$f":"\"\"","v":""}]
["6465, 75, 80 with DYNA VI TIER 2","2/4","CAB","DM",62,63,64,104,{"$f":"\"\"","v":""},{"$f":"\"\"","v":""},{"$f":"\"\"","v":""},{"$f":"\"\"","v":""},"Q61",{"$f":"\"\"","v":""},"Q66",{"$f":"\"\"","v":""},14321305,null,null,"15020BAA",{"$f":"\"\"","v":""},{"$f":"\"\"","v":""}," 10378270C","L","4",null,{"$f":"\"\"","v":""},{"$f":"\"\"","v":""}]
["6465, 75, 80 with DYNA VI TIER 3 (PERKINS)","4","CAB","DM",62,null,67,104,{"$f":"\"\"","v":""},{"$f":"\"\"","v":""},{"$f":"\"\"","v":""},{"$f":"\"\"","v":""},"Q61",{"$f":"\"\"","v":""},"Q66",{"$f":"\"\"","v":""},14322155,null,null,"15020BAA","15014FCA",{"$f":"\"\"","v":""},"10378287C","L","4",null,{"$f":"\"\"","v":""},{"$f":"\"\"","v":""}]
["6465, 75, 80 with DYNA VI TIER 3 (SISU)","4","CAB","DM",62,null,67,104,{"$f":"\"\"","v":""},{"$f":"\"\"","v":""},{"$f":"\"\"","v":""},{"$f":"\"\"","v":""},"Q61",{"$f":"\"\"","v":""},"Q66",{"$f":"\"\"","v":""},14326235,null,null,"15014BFA","15014FCA","10378252A","10378287C","L","4",null,{"$f":"\"\"","v":""},{"$f":"\"\"","v":""}]
["6485, 90, 95 with DYNA Shift TIER 2","4","CAB","DM",69,null,null,104,{"$f":"\"\"","v":""},{"$f":"\"\"","v":""},{"$f":"\"\"","v":""},{"$f":"\"\"","v":""},{"$f":"\"\"","v":""},{"$f":"\"\"","v":""},"Q76",{"$f":"\"\"","v":""},14320415,null,null,"15020BAA",{"$f":"\"\"","v":""},{"$f":"\"\"","v":""},"10378287C","L","4",null,{"$f":"\"\"","v":""},{"$f":"\"\"","v":""}]
["6485, 90, 95 with DYNA VI TIER 3","4","CAB","DM",62,65,67,104,{"$f":"\"\"","v":""},{"$f":"\"\"","v":""},{"$f":"\"\"","v":""},{"$f":"\"\"","v":""},{"$f":"\"\"","v":""},{"$f":"\"\"","v":""},"Q76",{"$f":"\"\"","v":""},14323295,null,null,"15014BFA","15014FCA","10378252A","10378287C","L","4",null,{"$f":"\"\"","v":""},{"$f":"\"\"","v":""}]
["6497, 6499 with DYNA VI TIER 2 (SISU)","4","CAB","DM",69,null,null,104,{"$f":"\"\"","v":""},{"$f":"\"\"","v":""},{"$f":"\"\"","v":""},{"$f":"\"\"","v":""},{"$f":"\"\"","v":""},{"$f":"\"\"","v":""},"Q76",{"$f":"\"\"","v":""},14320865,null,null,"15112BAA",{"$f":"\"\"","v":""},{"$f":"\"\"","v":""},"10378178C","L","4",null,{"$f":"\"\"","v":""},{"$f":"\"\"","v":""}]
["6497, 6499 with DYNA VI TIER 3 <176049","4","CAB","DM",65,68,null,104,{"$f":"\"\"","v":""},{"$f":"\"\"","v":""},{"$f":"\"\"","v":""},{"$f":"\"\"","v":""},{"$f":"\"\"","v":""},{"$f":"\"\"","v":""},"Q76",{"$f":"\"\"","v":""},14322465,null,null,"15014BFA",{"$f":"\"\"","v":""},{"$f":"\"\"","v":""},"10378287C","L","4",null,{"$f":"\"\"","v":""},{"$f":"\"\"","v":""}]
["6497, 6499 with DYNA VI TIER 3 >T189041","4","CAB","DM",62,67,68,104,{"$f":"\"\"","v":""},{"$f":"\"\"","v":""},{"$f":"\"\"","v":""},{"$f":"\"\"","v":""},{"$f":"\"\"","v":""},{"$f":"\"\"","v":""},"Q76",{"$f":"\"\"","v":""},14323295,null,null,"15014BFA","15014FCA","10378252A","10378287C","L","4",null,{"$f":"\"\"","v":""},{"$f":"\"\"","v":""}]
["7465, 75, 80 with DYNA VT TIER 2","2/4","CAB","DM",62,68,null,104,{"$f":"\"\"","v":""},{"$f":"\"\"","v":""},{"$f":"\"\"","v":""},{"$f":"\"\"","v":""},"Q61",{"$f":"\"\"","v":""},"Q66",{"$f":"\"\"","v":""},14320435,null,null,"15020BAA",{"$f":"\"\"","v":""},{"$f":"\"\"","v":""}," 10378269C","L","4",null,{"$f":"\"\"","v":""},{"$f":"\"\"","v":""}]
["7485, 90, 95 with DYNA VT TIER 2","4","CAB","DM",68,null,null,104,{"$f":"\"\"","v":""},{"$f":"\"\"","v":""},{"$f":"\"\"","v":""},{"$f":"\"\"","v":""},{"$f":"\"\"","v":""},{"$f":"\"\"","v":""},"Q76",{"$f":"\"\"","v":""},14320445,null,null,"15020BAA",{"$f":"\"\"","v":""},{"$f":"\"\"","v":""}," 10378269C","L","4",null,{"$f":"\"\"","v":""},{"$f":"\"\"","v":""}]
["7465, 75, 80 with DYNA VT TIER 3 (PERKINS)","4","CAB","DM",62,67,68,104,{"$f":"\"\"","v":""},{"$f":"\"\"","v":""},{"$f":"\"\"","v":""},{"$f":"\"\"","v":""},"Q61",{"$f":"\"\"","v":""},"Q66",{"$f":"\"\"","v":""},14323125,null,null,"15020BAA","15014FCA",{"$f":"\"\"","v":""}," 10378269C","L","4",null,{"$f":"\"\"","v":""},{"$f":"\"\"","v":""}]
["7465, 75, 80 with DYNA VT TIER 3 (SISU)","4","CAB","DM",62,67,68,104,{"$f":"\"\"","v":""},{"$f":"\"\"","v":""},{"$f":"\"\"","v":""},{"$f":"\"\"","v":""},"Q61",{"$f":"\"\"","v":""},"Q66",{"$f":"\"\"","v":""},14326225,null,null,"15014BFA","15014FCA","10378252A"," 10378269C","L","4",null,{"$f":"\"\"","v":""},{"$f":"\"\"","v":""}]
["8450, 60, 70, 80","4","CAB","DL","",null,null,null,{"$f":"\"\"","v":""},{"$f":"\"\"","v":""},{"$f":"\"\"","v":""},{"$f":"\"\"","v":""},{"$f":"\"\"","v":""},{"$f":"\"\"","v":""},"Q88",{"$f":"\"\"","v":""},14330115,null,null,"15110BAA",{"$f":"\"\"","v":""},{"$f":"\"\"","v":""},{"$f":"\"\"","v":""},"L","3",null,{"$f":"\"\"","v":""},{"$f":"\"\"","v":""}]
["2650, 2660, 2670, 2680 HD","2/4","ROPS/CAB","DM",57,null,null,null,"X31","X41","X36","X46","Q31","Q41","Q36","Q46",14325795,null,null,"15102BAA",{"$f":"\"\"","v":""},{"$f":"\"\"","v":""},{"$f":"\"\"","v":""},"L","4",null,{"$f":"\"\"","v":""},{"$f":"\"\"","v":""}]
["3625, 3635, 3645","2/4","ROPS/CAB","DM","",null,null,null,"X21",{"$f":"\"\"","v":""},"X26",{"$f":"\"\"","v":""},"Q21",{"$f":"\"\"","v":""},"Q26",{"$f":"\"\"","v":""},14325755,null,null,"15094BAA",{"$f":"\"\"","v":""},{"$f":"\"\"","v":""},{"$f":"\"\"","v":""},"L","4",null,{"$f":"\"\"","v":""},{"$f":"\"\"","v":""}]
["431, 461 ","4","ROPS","DM","",null,null,null,"X21",{"$f":"\"\"","v":""},"X26",{"$f":"\"\"","v":""},"Q21",{"$f":"\"\"","v":""},"Q26",{"$f":"\"\"","v":""},14321454,null,null,"15113BAA",{"$f":"\"\"","v":""},{"$f":"\"\"","v":""},{"$f":"\"\"","v":""},"L","4",null,{"$f":"\"\"","v":""},{"$f":"\"\"","v":""}]
["471, 481 ROPS","2/4","ROPS","DM",75,null,null,null,"X31",{"$f":"\"\"","v":""},"X36",{"$f":"\"\"","v":""},"Q31",{"$f":"\"\"","v":""},"Q36",{"$f":"\"\"","v":""},14321684,null,null,"15114BAA",{"$f":"\"\"","v":""},{"$f":"\"\"","v":""},{"$f":"\"\"","v":""},"L","4",null,{"$f":"\"\"","v":""},{"$f":"\"\"","v":""}]
["471, 481 CAB","2/4","CAB","DM",75,null,null,null,"X31",{"$f":"\"\"","v":""},"X36",{"$f":"\"\"","v":""},"Q31",{"$f":"\"\"","v":""},"Q36",{"$f":"\"\"","v":""},14323595,null,null,"15102BAA",{"$f":"\"\"","v":""},{"$f":"\"\"","v":""},{"$f":"\"\"","v":""},"L","4",null,{"$f":"\"\"","v":""},{"$f":"\"\"","v":""}]
["491, 492 ROPS","2/4","ROPS","DM","",null,null,null,"X41",{"$f":"\"\"","v":""},"X46",{"$f":"\"\"","v":""},"Q41",{"$f":"\"\"","v":""},"Q46",{"$f":"\"\"","v":""},14321425,null,null,"15114BAA",{"$f":"\"\"","v":""},{"$f":"\"\"","v":""},{"$f":"\"\"","v":""},"L","4",null,{"$f":"\"\"","v":""},{"$f":"\"\"","v":""}]
["491, 492 CAB","2/4","CAB","DM","",null,null,null,"X41",{"$f":"\"\"","v":""},"X46",{"$f":"\"\"","v":""},"Q41",{"$f":"\"\"","v":""},"Q46",{"$f":"\"\"","v":""},14321975,null,null,"15102BAA",{"$f":"\"\"","v":""},{"$f":"\"\"","v":""},{"$f":"\"\"","v":""},"L","4",null,{"$f":"\"\"","v":""},{"$f":"\"\"","v":""}]
["533, 543, 563","4","ROPS","DM","",null,null,null,"X21",{"$f":"\"\"","v":""},"X26",{"$f":"\"\"","v":""},"Q21",{"$f":"\"\"","v":""},"Q26",{"$f":"\"\"","v":""},14321454,null,null,"15107BAA",{"$f":"\"\"","v":""},{"$f":"\"\"","v":""},{"$f":"\"\"","v":""},"L","4",null,{"$f":"\"\"","v":""},{"$f":"\"\"","v":""}]
["3435, 3445, 3455 F & S Narrow","4","ROPS/CAB","DM",71,null,null,null,"X21",{"$f":"\"\"","v":""},"X26",{"$f":"\"\"","v":""},"Q21",{"$f":"\"\"","v":""},"Q26",{"$f":"\"\"","v":""},14322074,null,null,"15114BAA",{"$f":"\"\"","v":""},{"$f":"\"\"","v":""},{"$f":"\"\"","v":""},"L","4",null,{"$f":"\"\"","v":""},{"$f":"\"\"","v":""}]
["251XE, 451 ","4","ROPS","DM",46,null,null,null,"X21",{"$f":"\"\"","v":""},"X26",{"$f":"\"\"","v":""},"Q21",{"$f":"\"\"","v":""},"Q26",{"$f":"\"\"","v":""},14321674,null,1,10317736,{"$f":"\"\"","v":""},{"$f":"\"\"","v":""},{"$f":"\"\"","v":""},"L","4",1,{"$f":"\"\"","v":""},{"$f":"\"\"","v":""}]
["573, 583","2/4","ROPS/CAB","DM",74,null,null,null,"X31",{"$f":"\"\"","v":""},"X36",{"$f":"\"\"","v":""},"Q31",{"$f":"\"\"","v":""},"Q36",{"$f":"\"\"","v":""},14323595,null,null,"15098BAA",{"$f":"\"\"","v":""},{"$f":"\"\"","v":""},{"$f":"\"\"","v":""},"L","4",null,{"$f":"\"\"","v":""},{"$f":"\"\"","v":""}]
["593, 596 ROPS","2/4","ROPS","DM","",null,null,null,"X41",{"$f":"\"\"","v":""},"X46",{"$f":"\"\"","v":""},"Q41",{"$f":"\"\"","v":""},"Q46",{"$f":"\"\"","v":""},14321425,null,null,"15098BAA",{"$f":"\"\"","v":""},{"$f":"\"\"","v":""},{"$f":"\"\"","v":""},"L","4",null,{"$f":"\"\"","v":""},{"$f":"\"\"","v":""}]
["593, 596 CAB","2/4","CAB","DM","",null,null,null,"X41",{"$f":"\"\"","v":""},"X46",{"$f":"\"\"","v":""},"Q41",{"$f":"\"\"","v":""},"Q46",{"$f":"\"\"","v":""},14321975,null,null,"15102BAA",{"$f":"\"\"","v":""},{"$f":"\"\"","v":""},{"$f":"\"\"","v":""},{"$f":"IF(D282=\"US\",\"U\",\"L\")","v":"L"},{"$f":"IF(D282=\"DS\",\"3\",IF(D282=\"DM\",\"4\",IF(D282=\"US\",\"1\",IF(D282=\"UM\",\"2\",IF(D282=\"DL\",\"3\")))))","v":"4"},null,{"$f":"\"\"","v":""},{"$f":"\"\"","v":""}]
["265, 271, 281, 283","2/4","ROPS","DM",46,null,null,null,"X31",{"$f":"\"\"","v":""},"X36",{"$f":"\"\"","v":""},"Q31",{"$f":"\"\"","v":""},"Q36",{"$f":"\"\"","v":""},14321684,null,1,317284,{"$f":"\"\"","v":""},{"$f":"\"\"","v":""},{"$f":"\"\"","v":""},"L","4",1,{"$f":"\"\"","v":""},{"$f":"\"\"","v":""}]
["271 X/XE, 281 X/XE","2/4","ROPS","DM","",null,null,null,"X31",{"$f":"\"\"","v":""},"X36",{"$f":"\"\"","v":""},"Q31",{"$f":"\"\"","v":""},"Q36",{"$f":"\"\"","v":""},14321684,null,null,"15113BAA",{"$f":"\"\"","v":""},{"$f":"\"\"","v":""},{"$f":"\"\"","v":""},"L","4",null,{"$f":"\"\"","v":""},{"$f":"\"\"","v":""}]
["4225 - 4355, 4365 (4 Cyl) Cab","2/4","CAB","DM","",null,null,null,"X31","X41","X36","X46","Q31","Q41","Q36","Q46",14320915,null,null,"15096BAA",{"$f":"\"\"","v":""},{"$f":"\"\"","v":""},{"$f":"\"\"","v":""},"L","4",null,{"$f":"\"\"","v":""},{"$f":"\"\"","v":""}]
["4260, 4263, 4270, 4360, 4370 (6 Cyl) Cab","2/4","CAB","DM","",null,null,null,"X51",{"$f":"\"\"","v":""},"X56",{"$f":"\"\"","v":""},"Q51",{"$f":"\"\"","v":""},"Q56",{"$f":"\"\"","v":""},14320925,null,null,"15096BAA",{"$f":"\"\"","v":""},{"$f":"\"\"","v":""},{"$f":"\"\"","v":""},"L","4",null,{"$f":"\"\"","v":""},{"$f":"\"\"","v":""}]
["6260 - 6280","2/4","CAB","DM",72,null,null,null,{"$f":"\"\"","v":""},{"$f":"\"\"","v":""},{"$f":"\"\"","v":""},{"$f":"\"\"","v":""},"Q51","Q61","Q56","Q66",14320295,null,null,"15108BAA",{"$f":"\"\"","v":""},{"$f":"\"\"","v":""},{"$f":"\"\"","v":""},"L","4",null,{"$f":"\"\"","v":""},{"$f":"\"\"","v":""}]
["6290`","2/4","CAB","DM",72,104,null,null,{"$f":"\"\"","v":""},{"$f":"\"\"","v":""},{"$f":"\"\"","v":""},{"$f":"\"\"","v":""},"Q61",{"$f":"\"\"","v":""},"Q66",{"$f":"\"\"","v":""},14320295,null,null,"15108BAA",{"$f":"\"\"","v":""},{"$f":"\"\"","v":""},{"$f":"\"\"","v":""},"L","4",null,{"$f":"\"\"","v":""},{"$f":"\"\"","v":""}]
["6110 - 6140, 3050 - 3065","2/4","CAB","DM",73,null,null,null,"X31","X41","X36","X46","Q31","Q41","Q36","Q46",14323815,null,null,"15106BAA",{"$f":"\"\"","v":""},{"$f":"\"\"","v":""},{"$f":"\"\"","v":""},"L","4",null,{"$f":"\"\"","v":""},{"$f":"\"\"","v":""}]
["6160 - 6180","2/4","CAB","DM",73,null,null,null,{"$f":"\"\"","v":""},{"$f":"\"\"","v":""},{"$f":"\"\"","v":""},{"$f":"\"\"","v":""},"Q51","Q61","Q56","Q66",14323835,null,null,"15180BAA",{"$f":"\"\"","v":""},{"$f":"\"\"","v":""},{"$f":"\"\"","v":""},"L","4",null,{"$f":"\"\"","v":""},{"$f":"\"\"","v":""}]
["240, 243, 253, 263","4","ROPS",{"$f":"IF(E291=11,\"US\",\"DM\")","v":"US"},11,46,99,null,"X31",{"$f":"\"\"","v":""},"X36",{"$f":"\"\"","v":""},"Q21","Q31","Q26","Q36",346274,null,1,317251,{"$f":"\"\"","v":""},{"$f":"\"\"","v":""},{"$f":"\"\"","v":""},"U","1",1,{"$f":"\"\"","v":""},{"$f":"\"\"","v":""}]
["261'","2","ROPS","US",11,46,99,null,"X31",{"$f":"\"\"","v":""},"X36",{"$f":"\"\"","v":""},"Q21","Q31","Q26","Q36",344444,null,1,317282,{"$f":"\"\"","v":""},{"$f":"\"\"","v":""},{"$f":"\"\"","v":""},"U","1",1,{"$f":"\"\"","v":""},{"$f":"\"\"","v":""}]
["362'","2/4","ROPS","US",11,76,99,null,"X31","X41","X36","X46","Q31","Q41","Q36","Q46",344455,null,null,"15212BAA",{"$f":"\"\"","v":""},{"$f":"\"\"","v":""},{"$f":"\"\"","v":""},"U","1",null,{"$f":"\"\"","v":""},{"$f":"\"\"","v":""}]
["362'","4","ROPS","US",11,77,99,null,"X31","X41","X36","X46","Q31","Q41","Q36","Q46",344614,null,null,"15212BAA",{"$f":"\"\"","v":""},{"$f":"\"\"","v":""},{"$f":"\"\"","v":""},"U","1",null,{"$f":"\"\"","v":""},{"$f":"\"\"","v":""}]
["375 - 398 ","2/4","ROPS/CAB","US",11,46,78,99,"X31","X41","X36","X46","Q31","Q41","Q36","Q46",343375,null,1,317234,{"$f":"\"\"","v":""},{"$f":"\"\"","v":""},{"$f":"\"\"","v":""},"U","1",1,{"$f":"\"\"","v":""},{"$f":"\"\"","v":""}]
["375 - 398","2/4","ROPS/CAB","US",11,46,79,99,"X31","X41","X36","X46","Q31","Q41","Q36","Q46",341505,null,1,317234,{"$f":"\"\"","v":""},{"$f":"\"\"","v":""},{"$f":"\"\"","v":""},"U","1",1,{"$f":"\"\"","v":""},{"$f":"\"\"","v":""}]
["399'","2/4","ROPS/CAB","US",11,79,99,null,"X41","X51","X46","X56","Q41","Q51","Q46","Q56",340215,null,null,"15212BAA",{"$f":"\"\"","v":""},{"$f":"\"\"","v":""},{"$f":"\"\"","v":""},"U","1",null,{"$f":"\"\"","v":""},{"$f":"\"\"","v":""}]
["399'","4","ROPS/CAB","US",11,78,99,null,"X51",{"$f":"\"\"","v":""},"X56",{"$f":"\"\"","v":""},"Q51",{"$f":"\"\"","v":""},"Q56",{"$f":"\"\"","v":""},343415,null,null,"15212BAA",{"$f":"\"\"","v":""},{"$f":"\"\"","v":""},{"$f":"\"\"","v":""},"U","1",null,{"$f":"\"\"","v":""},{"$f":"\"\"","v":""}]
["6150'","2/4","CAB","US",11,99,null,null,"X41","X51","X46","X56","Q41","Q51","Q46","Q56",343845,null,null,"15106BAA",{"$f":"\"\"","v":""},{"$f":"\"\"","v":""},{"$f":"\"\"","v":""},"U","1",null,{"$f":"\"\"","v":""},{"$f":"\"\"","v":""}]
["4225 - 4355, 4365 (4 Cyl) Rops","2/4","ROPS","US",11,80,99,null,"X31","X41","X36","X46","Q31","Q41","Q36","Q46",346015,null,null,"15096BAA",{"$f":"\"\"","v":""},{"$f":"\"\"","v":""},{"$f":"\"\"","v":""},"U","1",null,{"$f":"\"\"","v":""},{"$f":"\"\"","v":""}]
["4260, 4263, 4270, 4360, 4370 (6 Cyl) Rops","2/4","ROPS","US",11,99,null,null,"X41","X51","X46","X56","Q41","Q51","Q46","Q56",346025,null,null,"15096BAA",{"$f":"\"\"","v":""},{"$f":"\"\"","v":""},{"$f":"\"\"","v":""},"U","1",null,{"$f":"\"\"","v":""},{"$f":"\"\"","v":""}]
["C-Max 60","2/4","ROPS","DM",81,99,null,null,"X21",{"$f":"\"\"","v":""},"X26",{"$f":"\"\"","v":""},"Q21",{"$f":"\"\"","v":""},"Q26",{"$f":"\"\"","v":""},14322105,null,null,"15199BAA",{"$f":"\"\"","v":""},{"$f":"\"\"","v":""},{"$f":"\"\"","v":""},"L","4",null,{"$f":"\"\"","v":""},{"$f":"\"\"","v":""}]
["C-Max 75 - 105 TIER 2 and 3","2/4","ROPS","DM",81,99,null,null,"X31","X41","X36","X46","Q31","Q41","Q36","Q46",14324755,null,null,"15199BAA",{"$f":"\"\"","v":""},{"$f":"\"\"","v":""},{"$f":"\"\"","v":""},"L","4",null,{"$f":"\"\"","v":""},{"$f":"\"\"","v":""}]
["T90Max, T100Max, T110Max","2/4","ROPS/CAB","DM",81,null,null,null,"X31",{"$f":"\"\"","v":""},"X36",{"$f":"\"\"","v":""},"Q31",{"$f":"\"\"","v":""},"Q36",{"$f":"\"\"","v":""},14325925,null,null,"15199BAA",{"$f":"\"\"","v":""},{"$f":"\"\"","v":""},{"$f":"\"\"","v":""},"L","4",null,{"$f":"\"\"","v":""},{"$f":"\"\"","v":""}]
["C70 - C100","2","ROPS","DM",46,null,null,null,"X31",{"$f":"\"\"","v":""},"X36",{"$f":"\"\"","v":""},"Q31",{"$f":"\"\"","v":""},"Q36",{"$f":"\"\"","v":""},14322244,null,1,10317683,{"$f":"\"\"","v":""},{"$f":"\"\"","v":""},{"$f":"\"\"","v":""},"L","4",1,{"$f":"\"\"","v":""},{"$f":"\"\"","v":""}]
["C70 - C100","4","ROPS","DM",46,null,null,null,"X31","X41","X36","X46","Q31","Q41","Q36","Q46",14322205,null,1,10317683,{"$f":"\"\"","v":""},{"$f":"\"\"","v":""},{"$f":"\"\"","v":""},"L","4",1,{"$f":"\"\"","v":""},{"$f":"\"\"","v":""}]
["C60/70/80L","2/4","ROPS","DM",86,99,null,null,"X21",{"$f":"\"\"","v":""},"X26",{"$f":"\"\"","v":""},"Q21",{"$f":"\"\"","v":""},"Q26",{"$f":"\"\"","v":""},14323695,null,null,"15050BAA",{"$f":"\"\"","v":""},{"$f":"\"\"","v":""},{"$f":"\"\"","v":""},"L","4",null,{"$f":"\"\"","v":""},{"$f":"\"\"","v":""}]
["CX70, 75, 80, 85, 90, 95, 100, 105 (Doncaster)","2/4","ROPS/CAB","DM","",null,null,null,"X31","X41","X36","X46","Q31","Q41","Q36","Q46",14322675,null,null,"15040BAA","15040FCA",{"$f":"\"\"","v":""},{"$f":"\"\"","v":""},"L","4",null,{"$f":"\"\"","v":""},{"$f":"\"\"","v":""}]
["CX90, 100, 110 TIER 3 (Italy)","4","CAB","DM","",null,null,null,"X41",{"$f":"\"\"","v":""},"X46",{"$f":"\"\"","v":""},"Q41",{"$f":"\"\"","v":""},"Q46",{"$f":"\"\"","v":""},14324625,null,null,"15040BAA","15040FCA",{"$f":"\"\"","v":""},{"$f":"\"\"","v":""},"L","4",null,{"$f":"\"\"","v":""},{"$f":"\"\"","v":""}]
["X50.20, X50.30, X50.40, X50.50","2/4","ROPS/CAB","DM",88,null,null,null,"X31","X41","X36","X46","Q31","Q41","Q36","Q46",14326485,null,null,"15315BAA","15315FCA",{"$f":"\"\"","v":""},{"$f":"\"\"","v":""},"L","4",null,{"$f":"\"\"","v":""},{"$f":"\"\"","v":""}]
["X60.20, X60.30, X60.40, X60.50 ","4","CAB","DM",85,null,null,null,"X31","X41","X36","X46","Q31","Q41","Q36","Q46",14325765,null,null,"15272BAA","15271FCA",{"$f":"\"\"","v":""},{"$f":"\"\"","v":""},"L","4",null,{"$f":"\"\"","v":""},{"$f":"\"\"","v":""}]
["MB55","2","ROPS","DM",99,null,null,null,"X21",{"$f":"\"\"","v":""},"X26",{"$f":"\"\"","v":""},"Q21",{"$f":"\"\"","v":""},"Q26",{"$f":"\"\"","v":""},14323575,null,null,"15068BAA",{"$f":"\"\"","v":""},{"$f":"\"\"","v":""},{"$f":"\"\"","v":""},"L","4",null,{"$f":"\"\"","v":""},{"$f":"\"\"","v":""}]
["MB65, 85","2/4","ROPS","DM",99,null,null,null,"X31","X41","X36","X46","Q31","Q41","Q36","Q46",14322765,null,null,"15068BAA",{"$f":"\"\"","v":""},{"$f":"\"\"","v":""},{"$f":"\"\"","v":""},"L","4",null,{"$f":"\"\"","v":""},{"$f":"\"\"","v":""}]
["MC80, 90, 100 and MC95, 105 TIER 2","2/4","ROPS/CAB","DM",82,null,null,null,"X41","X51","X46","X56","Q41","Q51","Q46","Q56",14320164,null,null,"15043BAA","15043FCA",{"$f":"\"\"","v":""},{"$f":"\"\"","v":""},{"$f":"IF(D314=\"US\",\"U\",\"L\")","v":"L"},{"$f":"IF(D314=\"DS\",\"3\",IF(D314=\"DM\",\"4\",IF(D314=\"US\",\"1\",IF(D314=\"UM\",\"2\",IF(D314=\"DL\",\"3\")))))","v":"4"},null,{"$f":"\"\"","v":""},{"$f":"\"\"","v":""}]
["MC105,115,130 TIER 3 and MC110 TIER 2","2/4","ROPS/CAB","DM",82,null,null,null,"X51",{"$f":"\"\"","v":""},"X56",{"$f":"\"\"","v":""},"Q51",{"$f":"\"\"","v":""},"Q56",{"$f":"\"\"","v":""},14324054,null,null,"15043BAA","15043FCA",{"$f":"\"\"","v":""},{"$f":"\"\"","v":""},"L","4",null,{"$f":"\"\"","v":""},{"$f":"\"\"","v":""}]
["MC120,135 Power VI TIER 2","4","CAB","DM",82,null,null,null,{"$f":"\"\"","v":""},{"$f":"\"\"","v":""},{"$f":"\"\"","v":""},{"$f":"\"\"","v":""},"Q51","Q61","Q56","Q66",14320754,null,null,"15043BAA","15043FCA",{"$f":"\"\"","v":""},{"$f":"\"\"","v":""},"L","4",null,{"$f":"\"\"","v":""},{"$f":"\"\"","v":""}]
["MC120,135 Power VI TIER 3","4","CAB","DM","",null,null,null,{"$f":"\"\"","v":""},{"$f":"\"\"","v":""},{"$f":"\"\"","v":""},{"$f":"\"\"","v":""},"Q51","Q61","Q56","Q66",14324964,null,null,"15043BAA","15043FCA",{"$f":"\"\"","v":""},{"$f":"\"\"","v":""},"L","4",null,{"$f":"\"\"","v":""},{"$f":"\"\"","v":""}]
["MTX 110, 125, 140, 155","2/4","ROPS/CAB","DM",83,null,null,null,{"$f":"\"\"","v":""},{"$f":"\"\"","v":""},{"$f":"\"\"","v":""},{"$f":"\"\"","v":""},"Q61",{"$f":"\"\"","v":""},"Q66",{"$f":"\"\"","v":""},14320044,null,null,"15043BAA","15043FCA",{"$f":"\"\"","v":""},{"$f":"\"\"","v":""},"L","4",null,{"$f":"\"\"","v":""},{"$f":"\"\"","v":""}]
["MTX 175, 200","4","CAB","DM",83,null,null,null,{"$f":"\"\"","v":""},{"$f":"\"\"","v":""},{"$f":"\"\"","v":""},{"$f":"\"\"","v":""},{"$f":"\"\"","v":""},{"$f":"\"\"","v":""},"Q76",{"$f":"\"\"","v":""},14320044,null,null,"15043BAA","15043FCA",{"$f":"\"\"","v":""},{"$f":"\"\"","v":""},"L","4",null,{"$f":"\"\"","v":""},{"$f":"\"\"","v":""}]
["MTX \"B\" 120, 135, 145, 150","2/4","ROPS/CAB","DM","",null,null,null,{"$f":"\"\"","v":""},{"$f":"\"\"","v":""},{"$f":"\"\"","v":""},{"$f":"\"\"","v":""},"Q61",{"$f":"\"\"","v":""},"Q66",{"$f":"\"\"","v":""},14328907,null,null,"15043BAA","15043FCA",{"$f":"\"\"","v":""},{"$f":"\"\"","v":""},"L","4",null,{"$f":"\"\"","v":""},{"$f":"\"\"","v":""}]
["MTX \"B\" 165, 185","4","CAB","DM","",null,null,null,{"$f":"\"\"","v":""},{"$f":"\"\"","v":""},{"$f":"\"\"","v":""},{"$f":"\"\"","v":""},{"$f":"\"\"","v":""},{"$f":"\"\"","v":""},"Q76",{"$f":"\"\"","v":""},14328907,null,null,"15043BAA","15043FCA",{"$f":"\"\"","v":""},{"$f":"\"\"","v":""},"L","4",null,{"$f":"\"\"","v":""},{"$f":"\"\"","v":""}]
["XTX 145, 165 TIER 2 and 3","4","CAB","DM","",null,null,null,{"$f":"\"\"","v":""},{"$f":"\"\"","v":""},{"$f":"\"\"","v":""},{"$f":"\"\"","v":""},"Q61",{"$f":"\"\"","v":""},"Q66",{"$f":"\"\"","v":""},14328907,null,null,"15311BAA","15311FCA",{"$f":"\"\"","v":""},{"$f":"\"\"","v":""},"L","4",null,{"$f":"\"\"","v":""},{"$f":"\"\"","v":""}]
["XTX 185, 200, 215","4","CAB","DM",84,86,null,null,{"$f":"\"\"","v":""},{"$f":"\"\"","v":""},{"$f":"\"\"","v":""},{"$f":"\"\"","v":""},{"$f":"\"\"","v":""},{"$f":"\"\"","v":""},"Q76",{"$f":"\"\"","v":""},14328907,null,null,"15311BAA","15311FCA",{"$f":"\"\"","v":""},{"$f":"\"\"","v":""},"L","4",null,{"$f":"\"\"","v":""},{"$f":"\"\"","v":""}]
["TTX 190, 210, 230","4","CAB","DM","",null,null,null,{"$f":"\"\"","v":""},{"$f":"\"\"","v":""},{"$f":"\"\"","v":""},{"$f":"\"\"","v":""},{"$f":"\"\"","v":""},{"$f":"\"\"","v":""},"Q76",{"$f":"\"\"","v":""},14328907,null,null,"15311BAA","15311FCA",{"$f":"\"\"","v":""},{"$f":"\"\"","v":""},"L","4",null,{"$f":"\"\"","v":""},{"$f":"\"\"","v":""}]
["F75, 85, 95, 105 F/GE Tier 2","4","ROPS/CAB","DS",4,99,null,null,{"$f":"\"\"","v":""},{"$f":"\"\"","v":""},{"$f":"\"\"","v":""},{"$f":"\"\"","v":""},"Q21",{"$f":"\"\"","v":""},"Q26",{"$f":"\"\"","v":""},14310665,null,null,"15066BAA",{"$f":"\"\"","v":""},{"$f":"\"\"","v":""},{"$f":"\"\"","v":""},"L","3",null,{"$f":"\"\"","v":""},{"$f":"\"\"","v":""}]
["F80, 90, 100, 110 Tier 3","4","ROPS/CAB","DS",4,99,null,null,{"$f":"\"\"","v":""},{"$f":"\"\"","v":""},{"$f":"\"\"","v":""},{"$f":"\"\"","v":""},"Q21",{"$f":"\"\"","v":""},"Q26",{"$f":"\"\"","v":""},14310665,null,null,"15253BAA",{"$f":"\"\"","v":""},{"$f":"\"\"","v":""},{"$f":"\"\"","v":""},"L","3",null,{"$f":"\"\"","v":""},{"$f":"\"\"","v":""}]
["TN55, 65, 75, TN60A, 70A, 75A","2/4","ROPS","DM",18,null,null,null,"X21","X31","X26","X36","Q21","Q31","Q26","Q36",14321994,null,null,"15053BAA",{"$f":"\"\"","v":""},"10378214D",{"$f":"\"\"","v":""},"L","4",null,{"$f":"\"\"","v":""},{"$f":"\"\"","v":""}]
["TN55D, 65D, 75D, TN60DA, 70DA, 75DA","2/4","CAB","DM",18,null,null,null,"X21","X31","X26","X36","Q21","Q31","Q26","Q36",14321994,null,null,"15023BAA",{"$f":"\"\"","v":""},"10378214D",{"$f":"\"\"","v":""},"L","4",null,{"$f":"\"\"","v":""},{"$f":"\"\"","v":""}]
["TN55S, 65S, 70S, 75S, TN60SA, 70SA, 75SA","4","ROPS/CAB","DM",18,87,null,null,{"$f":"\"\"","v":""},{"$f":"\"\"","v":""},{"$f":"\"\"","v":""},{"$f":"\"\"","v":""},"Q31",{"$f":"\"\"","v":""},"Q36",{"$f":"\"\"","v":""},"14321994-",null,null,"15023BAA",{"$f":"\"\"","v":""},"10378214D",{"$f":"\"\"","v":""},"L",6,null,{"$f":"\"\"","v":""},{"$f":"\"\"","v":""}]
["TN85A, 95A, 85DA, 95DA","2/4","ROPS/CAB","DM","",null,null,null,"X21","X31","X26","X36","Q21","Q31","Q26","Q36",14324025,null,null,"15023BAA",{"$f":"\"\"","v":""},"10378214D",{"$f":"\"\"","v":""},"L",{"$f":"IF(D330=\"DS\",\"3\",IF(D330=\"DM\",\"4\",IF(D330=\"US\",\"1\",IF(D330=\"UM\",\"2\",IF(D330=\"DL\",\"3\")))))","v":"4"},null,{"$f":"\"\"","v":""},{"$f":"\"\"","v":""}]
["TN65F, 75F, 90F, TN75FA, 85FA, 95FA","4","ROPS/CAB","DS",4,null,null,null,{"$f":"\"\"","v":""},{"$f":"\"\"","v":""},{"$f":"\"\"","v":""},{"$f":"\"\"","v":""},"Q21",{"$f":"\"\"","v":""},"Q26",{"$f":"\"\"","v":""},14310334,null,null,"15084BAA",{"$f":"\"\"","v":""},{"$f":"\"\"","v":""},{"$f":"\"\"","v":""},"L","3",null,{"$f":"\"\"","v":""},{"$f":"\"\"","v":""}]
["TD75D, 80D","2/4","ROPS/CAB","DM","",null,null,null,"X31","X41","X36","X46","Q31","Q41","Q36","Q46",14321285,null,null,"15025BAA",{"$f":"\"\"","v":""},{"$f":"\"\"","v":""},{"$f":"\"\"","v":""},"L","4",null,{"$f":"\"\"","v":""},{"$f":"\"\"","v":""}]
["TD95D","2/4","ROPS/CAB","DM","",null,null,null,"X41",{"$f":"\"\"","v":""},"X46",{"$f":"\"\"","v":""},"Q41",{"$f":"\"\"","v":""},"Q46",{"$f":"\"\"","v":""},14324725,null,null,"15025BAA",{"$f":"\"\"","v":""},{"$f":"\"\"","v":""},{"$f":"\"\"","v":""},"L","4",null,{"$f":"\"\"","v":""},{"$f":"\"\"","v":""}]
["TL 70, 80, 90, 100","2/4","ROPS/CAB","DM","",null,null,null,"X31","X41","X36","X46","Q31","Q41","Q36","Q46",14321215,null,null,"15048BAA",{"$f":"\"\"","v":""},"10378209D",{"$f":"\"\"","v":""},"L","4",null,{"$f":"\"\"","v":""},{"$f":"\"\"","v":""}]
["TL70A, 80A, 90A, 100A","2/4","ROPS/CAB","DM","",null,null,null,"X31","X41","X36","X46","Q31","Q41","Q36","Q46",14323955,null,null,"15019BAA",{"$f":"\"\"","v":""},"10378209D",{"$f":"\"\"","v":""},"L","4",null,{"$f":"\"\"","v":""},{"$f":"\"\"","v":""}]
["TS90, 100, 110","2/4","ROPS/CAB","DM","",null,null,null,"X41","X51","X46","X56","Q41","Q51","Q46","Q56",14320185,null,null,"15051BAA",{"$f":"\"\"","v":""},{"$f":"\"\"","v":""},{"$f":"\"\"","v":""},"L","4",null,{"$f":"\"\"","v":""},{"$f":"\"\"","v":""}]
["TS100A Plus / Deluxe","2/4","ROPS/CAB","DM","",null,null,null,"X41","X51","X46","X56","Q41","Q51","Q46","Q56",14323354,null,null,"15039BAA","15039FCA","10378137D"," 10378141M","L","4",null,{"$f":"\"\"","v":""},{"$f":"\"\"","v":""}]
["TS100A, 110A Super Steer","4","ROPS/CAB","DM",87,null,null,null,{"$f":"\"\"","v":""},{"$f":"\"\"","v":""},{"$f":"\"\"","v":""},{"$f":"\"\"","v":""},"Q51",{"$f":"\"\"","v":""},"Q56",{"$f":"\"\"","v":""},14323354,null,null,"15039BAA","15039FCA","10378137D"," 10378141M","L",4,null,{"$f":"\"\"","v":""},{"$f":"\"\"","v":""}]
["TS110A Standard","2/4","ROPS/CAB","DM","",null,null,null,"X41","X51","X46","X56","Q41","Q51","Q46","Q56",14323354,null,null,"15018BAB",{"$f":"\"\"","v":""},"10378137D"," 10378141M","L",{"$f":"IF(D339=\"DS\",\"3\",IF(D339=\"DM\",\"4\",IF(D339=\"US\",\"1\",IF(D339=\"UM\",\"2\",IF(D339=\"DL\",\"3\")))))","v":"4"},null,{"$f":"\"\"","v":""},{"$f":"\"\"","v":""}]
["TS115A, 125A, 135A Plus / Deluxe","2/4","ROPS/CAB","DM","",null,null,null,{"$f":"\"\"","v":""},{"$f":"\"\"","v":""},{"$f":"\"\"","v":""},{"$f":"\"\"","v":""},"Q51","Q61","Q56","Q66",14323364,null,null,"15039BAA","15039FCA","10378137D"," 10378141M","L",{"$f":"IF(D340=\"DS\",\"3\",IF(D340=\"DM\",\"4\",IF(D340=\"US\",\"1\",IF(D340=\"UM\",\"2\",IF(D340=\"DL\",\"3\")))))","v":"4"},null,{"$f":"\"\"","v":""},{"$f":"\"\"","v":""}]
["TS115A, 125A, 135A Super Steer","4","ROPS/CAB","DM",87,null,null,null,{"$f":"\"\"","v":""},{"$f":"\"\"","v":""},{"$f":"\"\"","v":""},{"$f":"\"\"","v":""},"Q61",{"$f":"\"\"","v":""},"Q66",{"$f":"\"\"","v":""},14323364,null,null,"15039BAA","15039FCA","10378137D"," 10378141M","L",4,null,{"$f":"\"\"","v":""},{"$f":"\"\"","v":""}]
["TS115A, 130A Standard","2/4","ROPS/CAB","DM","",null,null,null,{"$f":"\"\"","v":""},{"$f":"\"\"","v":""},{"$f":"\"\"","v":""},{"$f":"\"\"","v":""},"Q51","Q61","Q56","Q66",14323364,null,null,"15018BAB",{"$f":"\"\"","v":""},"10378137D"," 10378141M","L",{"$f":"IF(D342=\"DS\",\"3\",IF(D342=\"DM\",\"4\",IF(D342=\"US\",\"1\",IF(D342=\"UM\",\"2\",IF(D342=\"DL\",\"3\")))))","v":"4"},null,{"$f":"\"\"","v":""},{"$f":"\"\"","v":""}]
["TM120-165","2/4","ROPS/CAB","DM",5,100,null,null,{"$f":"\"\"","v":""},{"$f":"\"\"","v":""},{"$f":"\"\"","v":""},{"$f":"\"\"","v":""},"Q61",{"$f":"\"\"","v":""},"Q66","Q76",14322834,null,null,"15052BAA","15052FCA","10378137D"," 10378141M","L","4",null,{"$f":"\"\"","v":""},{"$f":"\"\"","v":""}]
["TM120 - 165 Super Steer","4","CAB","DM",87,92,100,null,{"$f":"\"\"","v":""},{"$f":"\"\"","v":""},{"$f":"\"\"","v":""},{"$f":"\"\"","v":""},"Q61",{"$f":"\"\"","v":""},"Q66","Q76",14322834,null,null,"15052BAA","15052FCA","10378137D"," 10378141M","L","4",null,{"$f":"\"\"","v":""},{"$f":"\"\"","v":""}]
["TM 175, 190","2/4","CAB","DM",100,null,null,null,{"$f":"\"\"","v":""},{"$f":"\"\"","v":""},{"$f":"\"\"","v":""},{"$f":"\"\"","v":""},{"$f":"\"\"","v":""},{"$f":"\"\"","v":""},"Q76",{"$f":"\"\"","v":""},14322834,null,null,"15052BAA","15052FCA","10378137D"," 10378141M","L","4",null,{"$f":"\"\"","v":""},{"$f":"\"\"","v":""}]
["TM 175, 190 Super Steer","4","CAB","DM",89,100,null,null,{"$f":"\"\"","v":""},{"$f":"\"\"","v":""},{"$f":"\"\"","v":""},{"$f":"\"\"","v":""},{"$f":"\"\"","v":""},{"$f":"\"\"","v":""},"Q76",{"$f":"\"\"","v":""},14322834,null,null,"15052BAA","15052FCA","10378137D"," 10378141M",{"$f":"IF(D346=\"US\",\"U\",\"L\")","v":"L"},"4",null,{"$f":"\"\"","v":""},{"$f":"\"\"","v":""}]
["TG 210 - 305 Super Steer","4","CAB","DL",89,null,null,null,{"$f":"\"\"","v":""},{"$f":"\"\"","v":""},{"$f":"\"\"","v":""},{"$f":"\"\"","v":""},{"$f":"\"\"","v":""},{"$f":"\"\"","v":""},"Q88",{"$f":"\"\"","v":""},14330034,null,null,"15090BAA","15090FCA",{"$f":"\"\"","v":""},{"$f":"\"\"","v":""},"L","3",null,{"$f":"\"\"","v":""},{"$f":"\"\"","v":""}]
["TB100, 110","2/4","ROPS","DM","",null,null,null,"X41","X51","X46","X56","Q41","Q51","Q46","Q56",14320895,null,null,"15093BAA",{"$f":"\"\"","v":""},{"$f":"\"\"","v":""},{"$f":"\"\"","v":""},"L","4",null,{"$f":"\"\"","v":""},{"$f":"\"\"","v":""}]
["TB120","2/4","ROPS","DM","",null,null,null,{"$f":"\"\"","v":""},{"$f":"\"\"","v":""},{"$f":"\"\"","v":""},{"$f":"\"\"","v":""},"Q61",{"$f":"\"\"","v":""},"Q66",{"$f":"\"\"","v":""},14320905,null,null,"15093BAA",{"$f":"\"\"","v":""},{"$f":"\"\"","v":""},{"$f":"\"\"","v":""},"L","4",null,{"$f":"\"\"","v":""},{"$f":"\"\"","v":""}]
["4835, 5635, 6635, 7635","2/4","ROPS/CAB","DM","",null,null,null,"X31","X41","X36","X46","Q31","Q41","Q36","Q46",14321215,null,null,"15048BAA",{"$f":"\"\"","v":""},{"$f":"\"\"","v":""},{"$f":"\"\"","v":""},"L","4",null,{"$f":"\"\"","v":""},{"$f":"\"\"","v":""}]
["5640, 6640, 7740","2/4","ROPS/CAB","DM",101,null,null,null,"X41","X51","X46","X56","Q41","Q51","Q46","Q56",14324255,null,null,"15051BAA",{"$f":"\"\"","v":""},{"$f":"\"\"","v":""},{"$f":"\"\"","v":""},"L","4",null,{"$f":"\"\"","v":""},{"$f":"\"\"","v":""}]
["7840 - 8340","2/4","ROPS/CAB","DM",null,null,null,null,"X51",{"$f":"\"\"","v":""},"X56",{"$f":"\"\"","v":""},"Q51",{"$f":"\"\"","v":""},"Q56",{"$f":"\"\"","v":""},14324265,null,null,"15051BAA",{"$f":"\"\"","v":""},{"$f":"\"\"","v":""},{"$f":"\"\"","v":""},"L","4",null,{"$f":"\"\"","v":""},{"$f":"\"\"","v":""}]
["8160, 8260, 8360, 8560","2/4","ROPS/CAB","DM",90,91,null,null,{"$f":"\"\"","v":""},{"$f":"\"\"","v":""},{"$f":"\"\"","v":""},{"$f":"\"\"","v":""},"Q61",{"$f":"\"\"","v":""},"Q66","Q76",14320005,null,null,"15087BAA",{"$f":"\"\"","v":""},{"$f":"\"\"","v":""},{"$f":"\"\"","v":""},"L","4",null,{"$f":"\"\"","v":""},{"$f":"\"\"","v":""}]
["8670, 8770, 8870, 8970","2/4","CAB","DL","",null,null,null,{"$f":"\"\"","v":""},{"$f":"\"\"","v":""},{"$f":"\"\"","v":""},{"$f":"\"\"","v":""},{"$f":"\"\"","v":""},{"$f":"\"\"","v":""},"Q88",{"$f":"\"\"","v":""},14330135,null,null,"15091BAA","15091FCA",{"$f":"\"\"","v":""},{"$f":"\"\"","v":""},"L","3",null,{"$f":"\"\"","v":""},{"$f":"\"\"","v":""}]
["TT60A, TT65A,TT75A","2/4","ROPS",{"$f":"IF(E355=11,\"US\",\"DM\")","v":"DM"},{"$f":"\"\"","v":""},{"$f":"\"\"","v":""},{"$f":"\"\"","v":""},{"$f":"\"\"","v":""},"X21",{"$f":"\"\"","v":""},"X26",{"$f":"\"\"","v":""},"Q21",{"$f":"\"\"","v":""},"Q26",{"$f":"\"\"","v":""},14327694,{"$f":"\"\"","v":""},{"$f":"\"\"","v":""},"15463BAA",{"$f":"\"\"","v":""},{"$f":"\"\"","v":""},{"$f":"\"\"","v":""},{"$f":"IF(D355=\"US\",\"U\",\"L\")","v":"L"},4,{"$f":"\"\"","v":""},{"$f":"\"\"","v":""},{"$f":"\"\"","v":""},{"$f":"\"\"","v":""},{"$f":"\"\"","v":""},{"$f":"\"\"","v":""},{"$f":"\"\"","v":""}]
["Workmaster 65, 75","2/4","ROPS",{"$f":"IF(E356=11,\"US\",\"DM\")","v":"DM"},{"$f":"\"\"","v":""},{"$f":"\"\"","v":""},{"$f":"\"\"","v":""},{"$f":"\"\"","v":""},"X21",{"$f":"\"\"","v":""},"X26",{"$f":"\"\"","v":""},"Q21",{"$f":"\"\"","v":""},"Q26",{"$f":"\"\"","v":""},14327694,{"$f":"\"\"","v":""},{"$f":"\"\"","v":""},"15463BAA",{"$f":"\"\"","v":""},{"$f":"\"\"","v":""},{"$f":"\"\"","v":""},{"$f":"IF(D356=\"US\",\"U\",\"L\")","v":"L"},4,{"$f":"\"\"","v":""},{"$f":"\"\"","v":""},{"$f":"\"\"","v":""},{"$f":"\"\"","v":""},{"$f":"\"\"","v":""},{"$f":"\"\"","v":""},{"$f":"\"\"","v":""}]
["T4020, T4030","2/4","ROPS/CAB",{"$f":"IF(E357=11,\"US\",\"DM\")","v":"DM"},null,null,null,null,"X21",{"$f":"\"\"","v":""},"X26",{"$f":"\"\"","v":""},"Q21",{"$f":"\"\"","v":""},"Q26",{"$f":"\"\"","v":""},14323765,null,{"$f":"\"\"","v":""},"15053BAA",{"$f":"\"\"","v":""},"10378214D",{"$f":"\"\"","v":""},"L",4,null,{"$f":"\"\"","v":""},{"$f":"\"\"","v":""}]
["T4020, T4030 Super Steer","2/4","ROPS/CAB",{"$f":"IF(E358=11,\"US\",\"DM\")","v":"DM"},87,null,null,null,{"$f":"\"\"","v":""},{"$f":"\"\"","v":""},{"$f":"\"\"","v":""},{"$f":"\"\"","v":""},{"$f":"\"\"","v":""},"Q31",{"$f":"\"\"","v":""},"Q36",14323365,null,{"$f":"\"\"","v":""},"15053BAA",{"$f":"\"\"","v":""},"10378214D",{"$f":"\"\"","v":""},"L",6,null,{"$f":"\"\"","v":""},{"$f":"\"\"","v":""}]
["T4040, T4050","2/4","ROPS/CAB","DM",null,null,null,null,"X21","X31","X26","X36","Q21","Q31","Q26","Q36",14324025,null,{"$f":"\"\"","v":""},"15053BAA",{"$f":"\"\"","v":""},"10378214D",{"$f":"\"\"","v":""},"L",4,null,{"$f":"\"\"","v":""},{"$f":"\"\"","v":""}]
["T4040, T4050 Super Steer","2/4","ROPS/CAB",{"$f":"IF(E360=11,\"US\",\"DM\")","v":"DM"},87,null,null,null,{"$f":"\"\"","v":""},{"$f":"\"\"","v":""},{"$f":"\"\"","v":""},{"$f":"\"\"","v":""},{"$f":"\"\"","v":""},"Q31",{"$f":"\"\"","v":""},"Q36",14324045,null,{"$f":"\"\"","v":""},"15053BAA",{"$f":"\"\"","v":""},"10378214D",{"$f":"\"\"","v":""},{"$f":"IF(D360=\"US\",\"U\",\"L\")","v":"L"},6,null,{"$f":"\"\"","v":""},{"$f":"\"\"","v":""}]
["T5030,40,50,60,70","2/4","ROPS/CAB",{"$f":"IF(E361=11,\"US\",\"DM\")","v":"DM"},"",null,null,null,"X31","X41","X36","X46","Q31","Q41","Q36","Q46",14323955,null,null,"15019BAA",{"$f":"\"\"","v":""},"10378209D",{"$f":"\"\"","v":""},"L",4,null,{"$f":"\"\"","v":""},{"$f":"\"\"","v":""}]
["TD 5020, 5030","2/4","CAB/ROPS",{"$f":"IF(E362=11,\"US\",\"DM\")","v":"DM"},94,null,null,null,"X31",{"$f":"\"\"","v":""},"X36",{"$f":"\"\"","v":""},"Q31",{"$f":"\"\"","v":""},"Q36",{"$f":"\"\"","v":""},14325845,null,null,"15025BAA",null,{"$f":"\"\"","v":""},{"$f":"\"\"","v":""},"L",{"$f":"IF(D362=\"DS\",\"3\",IF(D362=\"DM\",\"4\",IF(D362=\"US\",\"1\",IF(D362=\"UM\",\"2\",IF(D362=\"DL\",\"3\")))))","v":"4"},null,{"$f":"\"\"","v":""},{"$f":"\"\"","v":""}]
["TD 5040, 5050","2/4","CAB/ROPS","DM",94,null,null,null,"X41","X51","X46","X56","Q41","Q51","Q46","Q56",14324725,null,null,"15025BAA",null,{"$f":"\"\"","v":""},{"$f":"\"\"","v":""},"L","4",null,{"$f":"\"\"","v":""},{"$f":"\"\"","v":""}]
["TS 6020, 6030","2/4","CAB/ROPS","DM","",null,null,null,"X41",{"$f":"\"\"","v":""},"X46",{"$f":"\"\"","v":""},"Q41",{"$f":"\"\"","v":""},"Q46",{"$f":"\"\"","v":""},14324364,null,null,"15265BAA",{"$f":"\"\"","v":""},{"$f":"\"\"","v":""},{"$f":"\"\"","v":""},"L","4",null,{"$f":"\"\"","v":""},{"$f":"\"\"","v":""}]
["T 6010, 6020 Delta","2/4","CAB/ROPS","DM","",null,null,null,"X41","X51","X46","X56","Q41","Q51","Q46","Q56",14323354,null,null,"15018BAB","15021FCA","10378137D"," 10378141M","L","4",null,{"$f":"\"\"","v":""},{"$f":"\"\"","v":""}]
["T 6010 Plus, T 6020 Plus/Elite","2/4","CAB/ROPS","DM","",null,null,null,"X41","X51","X46","X56","Q41","Q51","Q46","Q56",14323354,null,null,"15039BAA","15039FCA","10378137D"," 10378141M","L","4",null,{"$f":"\"\"","v":""},{"$f":"\"\"","v":""}]
["T 6020, 6040 & T6060 Elite","2/4","CAB/ROPS","DM","",null,null,null,"X41","X51","X46","X56","Q41","Q51","Q46","Q56",14323354,null,null,"15018BAB","15039FCA","10378137D"," 10378141M","L","4",null,{"$f":"\"\"","v":""},{"$f":"\"\"","v":""}]
["T 6010, T6020 Plus/Elite Supersteer","2/4","CAB/ROPS","DM",87,null,null,null,{"$f":"\"\"","v":""},{"$f":"\"\"","v":""},{"$f":"\"\"","v":""},{"$f":"\"\"","v":""},"Q51",{"$f":"\"\"","v":""},"Q56",{"$f":"\"\"","v":""},"14323354-",null,null,"15039BAA","15039FCA","10378137D"," 10378141M","L",6,null,{"$f":"\"\"","v":""},{"$f":"\"\"","v":""}]
["T 6020, 6040 & T6060 Elite Supersteer","2/4","CAB/ROPS","DM",87,null,null,null,{"$f":"\"\"","v":""},{"$f":"\"\"","v":""},{"$f":"\"\"","v":""},{"$f":"\"\"","v":""},"Q51",{"$f":"\"\"","v":""},"Q56",{"$f":"\"\"","v":""},"14323354-",null,null,"15039BAA","15039FCA","10378137D"," 10378141M","L",6,null,{"$f":"\"\"","v":""},{"$f":"\"\"","v":""}]
["T 6030 & T6050 Delta","2/4","CAB/ROPS","DM","",null,null,null,{"$f":"\"\"","v":""},{"$f":"\"\"","v":""},{"$f":"\"\"","v":""},{"$f":"\"\"","v":""},"Q51","Q61","Q56","Q66",14323364,null,null,"15018BAB","15021FCA","10378137D"," 10378141M","L",{"$f":"IF(D370=\"DS\",\"3\",IF(D370=\"DM\",\"4\",IF(D370=\"US\",\"1\",IF(D370=\"UM\",\"2\",IF(D370=\"DL\",\"3\")))))","v":"4"},null,{"$f":"\"\"","v":""},{"$f":"\"\"","v":""}]
["T 6030, 6050, 6070 Plus/Elite","2/4","CAB/ROPS","DM","",null,null,null,{"$f":"\"\"","v":""},{"$f":"\"\"","v":""},{"$f":"\"\"","v":""},{"$f":"\"\"","v":""},"Q51","Q61","Q56","Q66",14323364,null,null,"15039BAA","15039FCA","10378137D"," 10378141M","L",{"$f":"IF(D371=\"DS\",\"3\",IF(D371=\"DM\",\"4\",IF(D371=\"US\",\"1\",IF(D371=\"UM\",\"2\",IF(D371=\"DL\",\"3\")))))","v":"4"},null,{"$f":"\"\"","v":""},{"$f":"\"\"","v":""}]
["T 6030, 6050, 6070 Plus/Elite Supersteer","2/4","CAB/ROPS","DM",87,null,null,null,{"$f":"\"\"","v":""},{"$f":"\"\"","v":""},{"$f":"\"\"","v":""},{"$f":"\"\"","v":""},"Q61",{"$f":"\"\"","v":""},"Q66",{"$f":"\"\"","v":""},"14323364-",null,null,"15039BAA","15039FCA","10378137D"," 10378141M","L",6,null,{"$f":"\"\"","v":""},{"$f":"\"\"","v":""}]
["T 7030 + Supersteer","2/4","CAB/ROPS","DM",93,null,null,null,{"$f":"\"\"","v":""},{"$f":"\"\"","v":""},{"$f":"\"\"","v":""},{"$f":"\"\"","v":""},{"$f":"\"\"","v":""},{"$f":"\"\"","v":""},"Q66","Q76",14325074,null,null,"15045BAA","15045FCA","10378264D",{"$f":"\"\"","v":""},"L",{"$f":"IF(D373=\"DS\",\"3\",IF(D373=\"DM\",\"4\",IF(D373=\"US\",\"1\",IF(D373=\"UM\",\"2\",IF(D373=\"DL\",\"3\")))))","v":"4"},null,{"$f":"\"\"","v":""},{"$f":"\"\"","v":""}]
["T 7030 CVT + Supersteer","2/4","CAB/ROPS","DM",93,null,null,null,{"$f":"\"\"","v":""},{"$f":"\"\"","v":""},{"$f":"\"\"","v":""},{"$f":"\"\"","v":""},{"$f":"\"\"","v":""},{"$f":"\"\"","v":""},"Q66","Q76",14325074,null,null,"15045BAA","15045FCA","10378264D",{"$f":"\"\"","v":""},"L","4",null,{"$f":"\"\"","v":""},{"$f":"\"\"","v":""}]
["T 7040, 7050, 7060 + CVT","2/4","CAB/ROPS","DM","",null,null,null,{"$f":"\"\"","v":""},{"$f":"\"\"","v":""},{"$f":"\"\"","v":""},{"$f":"\"\"","v":""},{"$f":"\"\"","v":""},{"$f":"\"\"","v":""},"Q76",{"$f":"\"\"","v":""},14325074,null,null,"15045BAA","15045FCA","10378264D",{"$f":"\"\"","v":""},"L","4",null,{"$f":"\"\"","v":""},{"$f":"\"\"","v":""}]
["T 7040, 7050, 7060  CVT + Supersteer","2/4","CAB/ROPS","DM","",null,null,null,{"$f":"\"\"","v":""},{"$f":"\"\"","v":""},{"$f":"\"\"","v":""},{"$f":"\"\"","v":""},{"$f":"\"\"","v":""},{"$f":"\"\"","v":""},"Q76",{"$f":"\"\"","v":""},14325074,null,null,"15045BAA","15045FCA","10378264D",{"$f":"\"\"","v":""},"L","4",null,{"$f":"\"\"","v":""},{"$f":"\"\"","v":""}]
["T 8020, 8030, 8040, 8050 ","2/4","CAB/ROPS","DL","",null,null,null,{"$f":"\"\"","v":""},{"$f":"\"\"","v":""},{"$f":"\"\"","v":""},{"$f":"\"\"","v":""},{"$f":"\"\"","v":""},{"$f":"\"\"","v":""},"Q88",{"$f":"\"\"","v":""},14330024,null,null,"15090BAA","15090FCA",{"$f":"\"\"","v":""},{"$f":"\"\"","v":""},"L","3",null,{"$f":"\"\"","v":""},{"$f":"\"\"","v":""}]
["T 8020, 8030, 8040, 8050 + Supersteer","2/4","CAB/ROPS","DL","",null,null,null,{"$f":"\"\"","v":""},{"$f":"\"\"","v":""},{"$f":"\"\"","v":""},{"$f":"\"\"","v":""},{"$f":"\"\"","v":""},{"$f":"\"\"","v":""},"Q88",{"$f":"\"\"","v":""},14330034,null,null,"15090BAA","15090FCA",{"$f":"\"\"","v":""},{"$f":"\"\"","v":""},"L","3",null,{"$f":"\"\"","v":""},{"$f":"\"\"","v":""}]
["3930, 4630","2/4","ROPS/CAB","DM",95,96,null,null,"X21",{"$f":"\"\"","v":""},"X26",{"$f":"\"\"","v":""},"Q21",{"$f":"\"\"","v":""},"Q26",{"$f":"\"\"","v":""},14329234,null,null,"15232BAA",{"$f":"\"\"","v":""},{"$f":"\"\"","v":""},{"$f":"\"\"","v":""},"L",4,null,{"$f":"\"\"","v":""},{"$f":"\"\"","v":""}]
["5030'","2/4","ROPS/CAB","US",11,95,96,null,"X31","X41","X36","X46","Q31","Q41","Q36","Q46",343235,null,null,"15232BAA",{"$f":"\"\"","v":""},{"$f":"\"\"","v":""},{"$f":"\"\"","v":""},"U","1",null,{"$f":"\"\"","v":""},{"$f":"\"\"","v":""}]
["5610 - 7610","2/4","ROPS/CAB","US",11,97,98,null,"X31","X41","X36","X46","Q31","Q41","Q36","Q46",342035,null,null,"15243BAA",{"$f":"\"\"","v":""},{"$f":"\"\"","v":""},{"$f":"\"\"","v":""},"U","1",null,{"$f":"\"\"","v":""},{"$f":"\"\"","v":""}]
["6710 - 7710","2/4","ROPS/CAB","US",11,98,99,null,"X41",{"$f":"\"\"","v":""},"X46",{"$f":"\"\"","v":""},"Q41",{"$f":"\"\"","v":""},"Q46",{"$f":"\"\"","v":""},342045,null,null,"15238BAA",{"$f":"\"\"","v":""},{"$f":"\"\"","v":""},{"$f":"\"\"","v":""},"U","1",null,{"$f":"\"\"","v":""},{"$f":"\"\"","v":""}]
["7810'","2/4","ROPS/CAB","US",11,98,99,null,"X51",{"$f":"\"\"","v":""},"X56",{"$f":"\"\"","v":""},"Q51",{"$f":"\"\"","v":""},"Q56",{"$f":"\"\"","v":""},341035,null,null,"15242BAA",{"$f":"\"\"","v":""},{"$f":"\"\"","v":""},{"$f":"\"\"","v":""},"U","1",null,{"$f":"\"\"","v":""},{"$f":"\"\"","v":""}]
["8210'","4","CAB","UM",10,12,97,98,{"$f":"\"\"","v":""},{"$f":"\"\"","v":""},{"$f":"\"\"","v":""},{"$f":"\"\"","v":""},{"$f":"\"\"","v":""},{"$f":"\"\"","v":""},"Q56","Q66",320285,null,1,317043,{"$f":"\"\"","v":""},{"$f":"\"\"","v":""},{"$f":"\"\"","v":""},"L","2",1,{"$f":"\"\"","v":""},{"$f":"\"\"","v":""}]
["800, 900","2/4","ROPS","DM",99,null,null,null,"X41",{"$f":"\"\"","v":""},"X46",{"$f":"\"\"","v":""},"Q41",{"$f":"\"\"","v":""},"Q46",{"$f":"\"\"","v":""},14325135,null,null,"15031BAA","15031FCA",{"$f":"\"\"","v":""},{"$f":"\"\"","v":""},"L","4",null,{"$f":"\"\"","v":""},{"$f":"\"\"","v":""}]
["A72, A75, A82, A85, A92, A95","2/4","CAB","DM",99,null,null,null,"X41",{"$f":"\"\"","v":""},"X46",{"$f":"\"\"","v":""},"Q41",{"$f":"\"\"","v":""},"Q46",{"$f":"\"\"","v":""},14325135,null,null,"15031BAA","15031FCA",{"$f":"\"\"","v":""},{"$f":"\"\"","v":""},"L","4",null,{"$f":"\"\"","v":""},{"$f":"\"\"","v":""}]
["C90, 100, 110, 120, 130, 150","4","CAB","DM","B3",99,null,null,{"$f":"\"\"","v":""},{"$f":"\"\"","v":""},{"$f":"\"\"","v":""},{"$f":"\"\"","v":""},"Q51","Q61","Q56","Q66",14325284,null,null,{"$f":"\"\"","v":""},{"$f":"\"\"","v":""},"10378133B ",{"$f":"\"\"","v":""},"L","4",null,{"$f":"\"\"","v":""},{"$f":"\"\"","v":""}]
["N82, N92","4","CAB","DM","B5",99,null,null,"X41",{"$f":"\"\"","v":""},"X46",{"$f":"\"\"","v":""},"Q41",{"$f":"\"\"","v":""},"Q46",{"$f":"\"\"","v":""},14323674,null,null,"15027BAA","15027FCA",{"$f":"\"\"","v":""},{"$f":"\"\"","v":""},"L","4",null,{"$f":"\"\"","v":""},{"$f":"\"\"","v":""}]
["N91, 101,111, 111e, 121, 141","4","CAB","DM",99,null,null,null,{"$f":"\"\"","v":""},{"$f":"\"\"","v":""},{"$f":"\"\"","v":""},{"$f":"\"\"","v":""},"Q51","Q61","Q56","Q66",14325284,null,null,"15027BAA","15027FCA",{"$f":"\"\"","v":""},{"$f":"\"\"","v":""},"L","4"]
["N121ADV, N141ADV","4","CAB","DM",99,null,null,null,{"$f":"\"\"","v":""},{"$f":"\"\"","v":""},{"$f":"\"\"","v":""},{"$f":"\"\"","v":""},"Q51","Q61","Q56","Q66",14325284,null,null,"15034BAA","15034FCA",{"$f":"\"\"","v":""},{"$f":"\"\"","v":""},"L","4"]
["N122, N142 Direct / Versu","4","CAB","DM",99,null,null,null,{"$f":"\"\"","v":""},{"$f":"\"\"","v":""},{"$f":"\"\"","v":""},{"$f":"\"\"","v":""},"Q51","Q61","Q56","Q66",14325294,null,null,"15172BAA","15172FCA",{"$f":"\"\"","v":""},{"$f":"\"\"","v":""},"L","4"]
["T121, 131, 151, 161, 171, 191 Classic","4","CAB","DM","B3",99,null,null,{"$f":"\"\"","v":""},{"$f":"\"\"","v":""},{"$f":"\"\"","v":""},{"$f":"\"\"","v":""},"Q61",{"$f":"\"\"","v":""},"Q66","Q76",14320555,null,null,"15028BAA","15028FCA",{"$f":"\"\"","v":""},{"$f":"\"\"","v":""},"L","4"]
["T151, 161, 171, 191 ADV","4","CAB","DM","B3",99,null,null,{"$f":"\"\"","v":""},{"$f":"\"\"","v":""},{"$f":"\"\"","v":""},{"$f":"\"\"","v":""},"Q61",{"$f":"\"\"","v":""},"Q66","Q76",14320555,null,null,"15034BAA","15034FCA",{"$f":"\"\"","v":""},{"$f":"\"\"","v":""},"L","4"]
["T120, 130, 140, 160, 170 Classic","4","CAB","DM","B3",99,null,null,{"$f":"\"\"","v":""},{"$f":"\"\"","v":""},{"$f":"\"\"","v":""},{"$f":"\"\"","v":""},"Q61",{"$f":"\"\"","v":""},"Q66","Q76",14320555,null,null,"15028BAA","15028FCA",{"$f":"\"\"","v":""},{"$f":"\"\"","v":""},"L","4"]
["T120, 130, 140, 160, 170, 180, 190","4","CAB","DM","B3","B4",99,null,{"$f":"\"\"","v":""},{"$f":"\"\"","v":""},{"$f":"\"\"","v":""},{"$f":"\"\"","v":""},"Q61",{"$f":"\"\"","v":""},"Q66","Q76",14320555,null,null,"15118BAA","15118FCA","10378133B ",{"$f":"\"\"","v":""},"L","4"]
["6100 - 6850","4","CAB","DM","B1","B2","B3",99,"X41","X51","X46","X56","Q41","Q51","Q46","Q56",14320575,null,null,"15027BAA","15027FCA",{"$f":"\"\"","v":""},{"$f":"\"\"","v":""},"L","4"]
["M120, 130, 150","4","CAB","DM","B3","B4",99,null,{"$f":"\"\"","v":""},{"$f":"\"\"","v":""},{"$f":"\"\"","v":""},{"$f":"\"\"","v":""},"Q51","Q61","Q56","Q66",14320585,null,null,"15118BAA","15118FCA","10378133B ",{"$f":"\"\"","v":""},"L","4"]
["8000 - 8450","4","CAB","DM","B1","B2","B3",99,{"$f":"\"\"","v":""},{"$f":"\"\"","v":""},{"$f":"\"\"","v":""},{"$f":"\"\"","v":""},"Q61",{"$f":"\"\"","v":""},"Q66",{"$f":"\"\"","v":""},14320615,null,null,"15027BAA","15027FCA",{"$f":"\"\"","v":""},{"$f":"\"\"","v":""},"L","4"]
["8550 - 8950","4","CAB","DM","B1","B2","B3",99,{"$f":"\"\"","v":""},{"$f":"\"\"","v":""},{"$f":"\"\"","v":""},{"$f":"\"\"","v":""},{"$f":"\"\"","v":""},{"$f":"\"\"","v":""},"Q76",{"$f":"\"\"","v":""},14320615,null,null,"15027BAA","15027FCA",{"$f":"\"\"","v":""},{"$f":"\"\"","v":""},"L","4"]
["600, 700","2/4","ROPS","US",11,46,99,null,"X41",{"$f":"\"\"","v":""},"X46",{"$f":"\"\"","v":""},"Q41",{"$f":"\"\"","v":""},"Q46",{"$f":"\"\"","v":""},10347105,null,1,10317784,{"$f":"\"\"","v":""},{"$f":"\"\"","v":""},{"$f":"\"\"","v":""},"U","1",1]
["A65, A75","2/4","CAB","US",11,46,99,null,"X41",{"$f":"\"\"","v":""},"X46",{"$f":"\"\"","v":""},"Q41",{"$f":"\"\"","v":""},"Q46",{"$f":"\"\"","v":""},10347105,null,1,10317263,{"$f":"\"\"","v":""},{"$f":"\"\"","v":""},{"$f":"\"\"","v":""},"U","1",1]
["D35-45 / DX35-45 / FARMALL40-50 ",4,"ROPS/CAB","CM","A2",null,null,"A10","160C",{"$f":"\"\"","v":""},{"$f":"\"\"","v":""},{"$f":"\"\"","v":""},{"$f":"\"\"","v":""},{"$f":"\"\"","v":""},{"$f":"\"\"","v":""},{"$f":"\"\"","v":""},14100095,50035527,null,{"$f":"\"\"","v":""},{"$f":"\"\"","v":""},{"$f":"\"\"","v":""},{"$f":"\"\"","v":""},"C","C",{"$f":"\"\"","v":""},"18001A","18002B"]
["DX48, 55 / FARMALL 55, 60 ",4,"ROPS/CAB","CM","A1","A2",null,"A10","180C",{"$f":"\"\"","v":""},{"$f":"\"\"","v":""},{"$f":"\"\"","v":""},{"$f":"\"\"","v":""},{"$f":"\"\"","v":""},{"$f":"\"\"","v":""},{"$f":"\"\"","v":""},14100055,14110004,null,{"$f":"\"\"","v":""},{"$f":"\"\"","v":""},{"$f":"\"\"","v":""},{"$f":"\"\"","v":""},"C","C",{"$f":"\"\"","v":""},"18001A","18002B"]
["FARMALL 30B, 35B ",4,"ROPS","CM","A2","A3","A4","A10","140C","160C",{"$f":"\"\"","v":""},{"$f":"\"\"","v":""},{"$f":"\"\"","v":""},{"$f":"\"\"","v":""},{"$f":"\"\"","v":""},{"$f":"\"\"","v":""},14100014,50062947,null,{"$f":"\"\"","v":""},{"$f":"\"\"","v":""},"28001D",{"$f":"\"\"","v":""},"C","C",{"$f":"\"\"","v":""},{"$f":"\"\"","v":""},{"$f":"\"\"","v":""}]
["FARMALL 40B, 50B ",4,"ROPS","CM","A2","A3","A4","A10","160C",{"$f":"\"\"","v":""},{"$f":"\"\"","v":""},{"$f":"\"\"","v":""},{"$f":"\"\"","v":""},{"$f":"\"\"","v":""},{"$f":"\"\"","v":""},{"$f":"\"\"","v":""},14100025,50062947,null,{"$f":"\"\"","v":""},{"$f":"\"\"","v":""},"28001D",{"$f":"\"\"","v":""},"C","C",{"$f":"\"\"","v":""},{"$f":"\"\"","v":""},{"$f":"\"\"","v":""}]
["DX25, DX 29, DX33, DX35",4,"ROPS","CM","A2",null,null,null,"140C",{"$f":"\"\"","v":""},{"$f":"\"\"","v":""},{"$f":"\"\"","v":""},{"$f":"\"\"","v":""},{"$f":"\"\"","v":""},{"$f":"\"\"","v":""},{"$f":"\"\"","v":""},14120155,14110046,null,{"$f":"\"\"","v":""},{"$f":"\"\"","v":""},{"$f":"\"\"","v":""},{"$f":"\"\"","v":""},"C","C",{"$f":"\"\"","v":""},{"$f":"\"\"","v":""},"18038B"]
["DX29, 31, 33 FARMALL",4,"ROPS","CM","A2",null,null,null,"140C",{"$f":"\"\"","v":""},{"$f":"\"\"","v":""},{"$f":"\"\"","v":""},{"$f":"\"\"","v":""},{"$f":"\"\"","v":""},{"$f":"\"\"","v":""},{"$f":"\"\"","v":""},14120155,14110046,null,{"$f":"\"\"","v":""},{"$f":"\"\"","v":""},{"$f":"\"\"","v":""},{"$f":"\"\"","v":""},"C","C",{"$f":"\"\"","v":""},{"$f":"\"\"","v":""},"18038B"]
["DX34 FARMALL",4,"ROPS","CM","A2",null,null,null,"140C",{"$f":"\"\"","v":""},{"$f":"\"\"","v":""},{"$f":"\"\"","v":""},{"$f":"\"\"","v":""},{"$f":"\"\"","v":""},{"$f":"\"\"","v":""},{"$f":"\"\"","v":""},14120155,14110046,null,{"$f":"\"\"","v":""},{"$f":"\"\"","v":""},{"$f":"\"\"","v":""},{"$f":"\"\"","v":""},"C","C",{"$f":"\"\"","v":""},{"$f":"\"\"","v":""},"18038B"]
["5045D,5055D","2/4","ROPS","CM","A5",{"$f":"\"\"","v":""},{"$f":"\"\"","v":""},"A10","180C",{"$f":"\"\"","v":""},{"$f":"\"\"","v":""},{"$f":"\"\"","v":""},{"$f":"\"\"","v":""},{"$f":"\"\"","v":""},{"$f":"\"\"","v":""},{"$f":"\"\"","v":""},14100544,14110027,{"$f":"\"\"","v":""},{"$f":"\"\"","v":""},{"$f":"\"\"","v":""},{"$f":"\"\"","v":""},{"$f":"\"\"","v":""},"C","C",{"$f":"\"\"","v":""},{"$f":"\"\"","v":""},"18015B"]
["B3200, B3300 ",4,"ROPS","CM","A3","A4",{"$f":"\"\"","v":""},{"$f":"\"\"","v":""},"100C",{"$f":"\"\"","v":""},{"$f":"\"\"","v":""},{"$f":"\"\"","v":""},{"$f":"\"\"","v":""},{"$f":"\"\"","v":""},{"$f":"\"\"","v":""},{"$f":"\"\"","v":""},14100664,50035035,{"$f":"\"\"","v":""},{"$f":"\"\"","v":""},{"$f":"\"\"","v":""},"28020D",{"$f":"\"\"","v":""},"C","C",{"$f":"\"\"","v":""},{"$f":"\"\"","v":""}]
["L2800, L3400,L3200,L3800,3301,L3901 ",4,"ROPS","CM","A3",{"$f":"\"\"","v":""},{"$f":"\"\"","v":""},"A10","140C","160C",{"$f":"\"\"","v":""},{"$f":"\"\"","v":""},{"$f":"\"\"","v":""},{"$f":"\"\"","v":""},{"$f":"\"\"","v":""},{"$f":"\"\"","v":""},14100654,14110028,{"$f":"\"\"","v":""},{"$f":"\"\"","v":""},{"$f":"\"\"","v":""},{"$f":"\"\"","v":""},{"$f":"\"\"","v":""},"C","C",{"$f":"\"\"","v":""},{"$f":"\"\"","v":""},"18022B"]
["L3240 2/4WD, L3540, L3940 ",4,"ROPS/CAB","CM","A1","A2","A3","A10","160C",{"$f":"\"\"","v":""},{"$f":"\"\"","v":""},{"$f":"\"\"","v":""},{"$f":"\"\"","v":""},{"$f":"\"\"","v":""},{"$f":"\"\"","v":""},{"$f":"\"\"","v":""},14100535,14110026,{"$f":"\"\"","v":""},{"$f":"\"\"","v":""},{"$f":"\"\"","v":""},"28014D",{"$f":"\"\"","v":""},"C","C",{"$f":"\"\"","v":""},{"$f":"\"\"","v":""},{"$f":"\"\"","v":""}]
["L5240, L5740",4,"ROPS/CAB","CM","A1","A2","A3","A10","180C",{"$f":"\"\"","v":""},{"$f":"\"\"","v":""},{"$f":"\"\"","v":""},{"$f":"\"\"","v":""},{"$f":"\"\"","v":""},{"$f":"\"\"","v":""},{"$f":"\"\"","v":""},14100585,14110026,{"$f":"\"\"","v":""},{"$f":"\"\"","v":""},{"$f":"\"\"","v":""},"28014D",{"$f":"\"\"","v":""},"C","C",{"$f":"\"\"","v":""},{"$f":"\"\"","v":""},{"$f":"\"\"","v":""}]
["MX4700, MX5100 ","2/4","ROPS","CM","A2","A3",{"$f":"\"\"","v":""},"A10","180C",{"$f":"\"\"","v":""},{"$f":"\"\"","v":""},{"$f":"\"\"","v":""},{"$f":"\"\"","v":""},{"$f":"\"\"","v":""},{"$f":"\"\"","v":""},{"$f":"\"\"","v":""},14100525,14110026,{"$f":"\"\"","v":""},{"$f":"\"\"","v":""},{"$f":"\"\"","v":""},{"$f":"\"\"","v":""},{"$f":"\"\"","v":""},"C","C",{"$f":"\"\"","v":""},null,"18014B"]
["CK20S, CK20SHST ",4,"ROPS","CM","A2","A4",{"$f":"\"\"","v":""},{"$f":"\"\"","v":""},"100C",{"$f":"\"\"","v":""},{"$f":"\"\"","v":""},{"$f":"\"\"","v":""},{"$f":"\"\"","v":""},{"$f":"\"\"","v":""},{"$f":"\"\"","v":""},{"$f":"\"\"","v":""},14100605,14110022,{"$f":"\"\"","v":""},{"$f":"\"\"","v":""},{"$f":"\"\"","v":""},"28011D",{"$f":"\"\"","v":""},"C","C",{"$f":"\"\"","v":""},null,{"$f":"\"\"","v":""}]
["DK40SE, DK45SE , DK50SE + HST ",4,"ROPS/CAB","CM","A1","A2","A4","A10","160C",{"$f":"\"\"","v":""},{"$f":"\"\"","v":""},{"$f":"\"\"","v":""},{"$f":"\"\"","v":""},{"$f":"\"\"","v":""},{"$f":"\"\"","v":""},{"$f":"\"\"","v":""},14100555,14110023,{"$f":"\"\"","v":""},{"$f":"\"\"","v":""},{"$f":"\"\"","v":""},"28012D",{"$f":"\"\"","v":""},"C","C",{"$f":"\"\"","v":""},{"$f":"\"\"","v":""},{"$f":"\"\"","v":""}]
["DK55, DK55C ",4,"ROPS/CAB","CM","A1","A2","A4","A10","180C",{"$f":"\"\"","v":""},{"$f":"\"\"","v":""},{"$f":"\"\"","v":""},{"$f":"\"\"","v":""},{"$f":"\"\"","v":""},{"$f":"\"\"","v":""},{"$f":"\"\"","v":""},14100614,14110024,{"$f":"\"\"","v":""},{"$f":"\"\"","v":""},{"$f":"\"\"","v":""},"28013D",{"$f":"\"\"","v":""},"C","C",{"$f":"\"\"","v":""},{"$f":"\"\"","v":""},{"$f":"\"\"","v":""}]
["1-25H",4,"ROPS","CM","A2","A4",{"$f":"\"\"","v":""},{"$f":"\"\"","v":""},"100C",{"$f":"\"\"","v":""},{"$f":"\"\"","v":""},{"$f":"\"\"","v":""},{"$f":"\"\"","v":""},{"$f":"\"\"","v":""},{"$f":"\"\"","v":""},{"$f":"\"\"","v":""},14100605,14110022,{"$f":"\"\"","v":""},{"$f":"\"\"","v":""},{"$f":"\"\"","v":""},"28011D",{"$f":"\"\"","v":""},"C","C",{"$f":"\"\"","v":""},{"$f":"\"\"","v":""},{"$f":"\"\"","v":""}]
["1-40M/HC , 1-50M/HC",4,"ROPS/CAB","CM","A1","A2","A4","A10","160C",{"$f":"\"\"","v":""},{"$f":"\"\"","v":""},{"$f":"\"\"","v":""},{"$f":"\"\"","v":""},{"$f":"\"\"","v":""},{"$f":"\"\"","v":""},{"$f":"\"\"","v":""},14100555,14110023,{"$f":"\"\"","v":""},{"$f":"\"\"","v":""},{"$f":"\"\"","v":""},"28012D",{"$f":"\"\"","v":""},"C","C",{"$f":"\"\"","v":""},{"$f":"\"\"","v":""},{"$f":"\"\"","v":""}]
["1-55M/C",4,"ROPS/CAB","CM","A1","A2","A4","A10","180C",{"$f":"\"\"","v":""},{"$f":"\"\"","v":""},{"$f":"\"\"","v":""},{"$f":"\"\"","v":""},{"$f":"\"\"","v":""},{"$f":"\"\"","v":""},{"$f":"\"\"","v":""},14100614,14110024,{"$f":"\"\"","v":""},{"$f":"\"\"","v":""},{"$f":"\"\"","v":""},"28013D",{"$f":"\"\"","v":""},"C","C",{"$f":"\"\"","v":""},{"$f":"\"\"","v":""},{"$f":"\"\"","v":""}]
["X10.25H",4,"ROPS","CM","A2","A4",{"$f":"\"\"","v":""},{"$f":"\"\"","v":""},"100C",{"$f":"\"\"","v":""},{"$f":"\"\"","v":""},{"$f":"\"\"","v":""},{"$f":"\"\"","v":""},{"$f":"\"\"","v":""},{"$f":"\"\"","v":""},{"$f":"\"\"","v":""},14100605,14110022,{"$f":"\"\"","v":""},{"$f":"\"\"","v":""},{"$f":"\"\"","v":""},"28011D",{"$f":"\"\"","v":""},"C","C",{"$f":"\"\"","v":""},{"$f":"\"\"","v":""},{"$f":"\"\"","v":""}]
["X10.40M/HC , X10.50M/HC",4,"ROPS/CAB","CM",null,"A2","A4","A10","160C",{"$f":"\"\"","v":""},{"$f":"\"\"","v":""},{"$f":"\"\"","v":""},{"$f":"\"\"","v":""},{"$f":"\"\"","v":""},{"$f":"\"\"","v":""},{"$f":"\"\"","v":""},14100555,14110023,{"$f":"\"\"","v":""},{"$f":"\"\"","v":""},{"$f":"\"\"","v":""},"28012D",{"$f":"\"\"","v":""},"C","C",{"$f":"\"\"","v":""},{"$f":"\"\"","v":""},{"$f":"\"\"","v":""}]
["X10.55M/C",4,"ROPS/CAB","CM",null,"A2","A4","A10","180C",{"$f":"\"\"","v":""},{"$f":"\"\"","v":""},{"$f":"\"\"","v":""},{"$f":"\"\"","v":""},{"$f":"\"\"","v":""},{"$f":"\"\"","v":""},{"$f":"\"\"","v":""},14100614,14110024,{"$f":"\"\"","v":""},{"$f":"\"\"","v":""},{"$f":"\"\"","v":""},"28013D",{"$f":"\"\"","v":""},"C","C",{"$f":"\"\"","v":""},{"$f":"\"\"","v":""},{"$f":"\"\"","v":""}]
["T1110/Boomer1030",4,"ROPS","CM","A2","A9",null,null,"100C",null,{"$f":"\"\"","v":""},{"$f":"\"\"","v":""},{"$f":"\"\"","v":""},{"$f":"\"\"","v":""},{"$f":"\"\"","v":""},{"$f":"\"\"","v":""},14100154,14110005,null,null,null,null,null,"C","C",null,{"$f":"\"\"","v":""},"18005B"]
["T1530",4,"ROPS","CM","A2",null,null,null,"140C",null,{"$f":"\"\"","v":""},{"$f":"\"\"","v":""},{"$f":"\"\"","v":""},{"$f":"\"\"","v":""},{"$f":"\"\"","v":""},{"$f":"\"\"","v":""},14100595,14110014,null,null,null,null,null,"C","C",null,{"$f":"\"\"","v":""},"18002B"]
["Boomer 3040,45,50/T2310,2320,2330/TC35-45",4,"ROPS/CAB","CM","A8",null,null,"A10","160C",{"$f":"\"\"","v":""},{"$f":"\"\"","v":""},{"$f":"\"\"","v":""},{"$f":"\"\"","v":""},{"$f":"\"\"","v":""},{"$f":"\"\"","v":""},{"$f":"\"\"","v":""},14100095,50035527,null,{"$f":"\"\"","v":""},{"$f":"\"\"","v":""},null,{"$f":"\"\"","v":""},"C","C",{"$f":"\"\"","v":""},"18001A","18002B"]
["Boomer 4055,60/T2410,2420/TC48,55DA",4,"ROPS/CAB","CM","A8",null,null,"A10","180C",{"$f":"\"\"","v":""},{"$f":"\"\"","v":""},{"$f":"\"\"","v":""},{"$f":"\"\"","v":""},{"$f":"\"\"","v":""},{"$f":"\"\"","v":""},{"$f":"\"\"","v":""},14100055,14110004,null,{"$f":"\"\"","v":""},{"$f":"\"\"","v":""},null,{"$f":"\"\"","v":""},"C","C",{"$f":"\"\"","v":""},"18001A","18002B"]
["Boomer 30,35",4,"ROPS","CM","A2",null,null,"A10","140C","160C",{"$f":"\"\"","v":""},{"$f":"\"\"","v":""},{"$f":"\"\"","v":""},{"$f":"\"\"","v":""},{"$f":"\"\"","v":""},{"$f":"\"\"","v":""},14100014,50062947,null,{"$f":"\"\"","v":""},{"$f":"\"\"","v":""},"28001D",{"$f":"\"\"","v":""},"C","C",{"$f":"\"\"","v":""},{"$f":"\"\"","v":""},{"$f":"\"\"","v":""}]
["Boomer 40, 50",4,"ROPS","CM","A2",null,null,"A10","160C",{"$f":"\"\"","v":""},{"$f":"\"\"","v":""},{"$f":"\"\"","v":""},{"$f":"\"\"","v":""},{"$f":"\"\"","v":""},{"$f":"\"\"","v":""},{"$f":"\"\"","v":""},14100025,50062947,null,{"$f":"\"\"","v":""},{"$f":"\"\"","v":""},"28001D",{"$f":"\"\"","v":""},"C","C",{"$f":"\"\"","v":""},{"$f":"\"\"","v":""},{"$f":"\"\"","v":""}]
["TC25, TC 29, TC33 +DA",4,"ROPS","CM","A2",null,null,null,"140C",{"$f":"\"\"","v":""},{"$f":"\"\"","v":""},{"$f":"\"\"","v":""},{"$f":"\"\"","v":""},{"$f":"\"\"","v":""},{"$f":"\"\"","v":""},{"$f":"\"\"","v":""},14120155,14110046,null,{"$f":"\"\"","v":""},{"$f":"\"\"","v":""},{"$f":"\"\"","v":""},{"$f":"\"\"","v":""},"C","C",{"$f":"\"\"","v":""},{"$f":"\"\"","v":""},"18038B",{"$f":"\"\"","v":""},{"$f":"\"\"","v":""},{"$f":"\"\"","v":""}]
["BOOMER 2030,2035,T2210,T2220",4,"ROPS","CM","A2",null,null,null,"140C",{"$f":"\"\"","v":""},{"$f":"\"\"","v":""},{"$f":"\"\"","v":""},{"$f":"\"\"","v":""},{"$f":"\"\"","v":""},{"$f":"\"\"","v":""},{"$f":"\"\"","v":""},14120155,14110046,null,{"$f":"\"\"","v":""},{"$f":"\"\"","v":""},{"$f":"\"\"","v":""},{"$f":"\"\"","v":""},"C","C",{"$f":"\"\"","v":""},{"$f":"\"\"","v":""},"18038B",{"$f":"\"\"","v":""},{"$f":"\"\"","v":""},{"$f":"\"\"","v":""}]
["TC30, T1510,T1520",4,"ROPS","CM","A2",null,null,null,"140C",{"$f":"\"\"","v":""},{"$f":"\"\"","v":""},{"$f":"\"\"","v":""},{"$f":"\"\"","v":""},{"$f":"\"\"","v":""},{"$f":"\"\"","v":""},{"$f":"\"\"","v":""},14120155,14110046,null,{"$f":"\"\"","v":""},{"$f":"\"\"","v":""},{"$f":"\"\"","v":""},{"$f":"\"\"","v":""},"C","C",{"$f":"\"\"","v":""},{"$f":"\"\"","v":""},"18038B",{"$f":"\"\"","v":""},{"$f":"\"\"","v":""},{"$f":"\"\"","v":""}]
["5010'",4,"ROPS/CAB","CM","A1","A3",{"$f":"\"\"","v":""},"A10","180C",{"$f":"\"\"","v":""},{"$f":"\"\"","v":""},{"$f":"\"\"","v":""},{"$f":"\"\"","v":""},{"$f":"\"\"","v":""},{"$f":"\"\"","v":""},{"$f":"\"\"","v":""},14100225,14110013,{"$f":"\"\"","v":""},{"$f":"\"\"","v":""},{"$f":"\"\"","v":""},"28007D",{"$f":"\"\"","v":""},"C","C",{"$f":"\"\"","v":""},{"$f":"\"\"","v":""},{"$f":"\"\"","v":""}]
["5035'",4,"ROPS/CAB","CM","A2",{"$f":"\"\"","v":""},{"$f":"\"\"","v":""},"A10","180C",{"$f":"\"\"","v":""},{"$f":"\"\"","v":""},{"$f":"\"\"","v":""},{"$f":"\"\"","v":""},{"$f":"\"\"","v":""},{"$f":"\"\"","v":""},{"$f":"\"\"","v":""},14100125,14110007,{"$f":"\"\"","v":""},{"$f":"\"\"","v":""},{"$f":"\"\"","v":""},{"$f":"\"\"","v":""},{"$f":"\"\"","v":""},"C","C",{"$f":"\"\"","v":""},"18006A",{"$f":"\"\"","v":""}]
["GC2400, 2600 ","2/4","ROPS","CM","A2","A4","A7",{"$f":"\"\"","v":""},"100C",{"$f":"\"\"","v":""},{"$f":"\"\"","v":""},{"$f":"\"\"","v":""},{"$f":"\"\"","v":""},{"$f":"\"\"","v":""},{"$f":"\"\"","v":""},{"$f":"\"\"","v":""},14100104,14110010,{"$f":"\"\"","v":""},{"$f":"\"\"","v":""},{"$f":"\"\"","v":""},"28006D",{"$f":"\"\"","v":""},"C","C",{"$f":"\"\"","v":""},{"$f":"\"\"","v":""},{"$f":"\"\"","v":""}]
["1529, 1532 ","2/4","ROPS","CM","A2","A4",{"$f":"\"\"","v":""},{"$f":"\"\"","v":""},"140C",{"$f":"\"\"","v":""},{"$f":"\"\"","v":""},{"$f":"\"\"","v":""},{"$f":"\"\"","v":""},{"$f":"\"\"","v":""},{"$f":"\"\"","v":""},{"$f":"\"\"","v":""},14100195,14110009,{"$f":"\"\"","v":""},{"$f":"\"\"","v":""},{"$f":"\"\"","v":""},"28005D",{"$f":"\"\"","v":""},"C","C",{"$f":"\"\"","v":""},null,{"$f":"\"\"","v":""}]
["1533,1540, 1635 ","2/4","ROPS","CM","A2","A4",{"$f":"\"\"","v":""},"A10","140C","160C",{"$f":"\"\"","v":""},{"$f":"\"\"","v":""},{"$f":"\"\"","v":""},{"$f":"\"\"","v":""},{"$f":"\"\"","v":""},{"$f":"\"\"","v":""},14100185,14110025,{"$f":"\"\"","v":""},{"$f":"\"\"","v":""},{"$f":"\"\"","v":""},"28004D",{"$f":"\"\"","v":""},"C","C",{"$f":"\"\"","v":""},null,{"$f":"\"\"","v":""}]
["1547, 1552, 1648, 1652, 1655 ","2/4","ROPS/CAB","CM","A2","A4",{"$f":"\"\"","v":""},"A10","160C",{"$f":"\"\"","v":""},{"$f":"\"\"","v":""},{"$f":"\"\"","v":""},{"$f":"\"\"","v":""},{"$f":"\"\"","v":""},{"$f":"\"\"","v":""},{"$f":"\"\"","v":""},14100065,14110025,{"$f":"\"\"","v":""},{"$f":"\"\"","v":""},{"$f":"\"\"","v":""},"28004D",{"$f":"\"\"","v":""},"C","C",{"$f":"\"\"","v":""},null,{"$f":"\"\"","v":""}]
["1560, 1660 ","2/4","ROPS/CAB","CM","A2","A4",{"$f":"\"\"","v":""},"A10","180C",{"$f":"\"\"","v":""},{"$f":"\"\"","v":""},{"$f":"\"\"","v":""},{"$f":"\"\"","v":""},{"$f":"\"\"","v":""},{"$f":"\"\"","v":""},{"$f":"\"\"","v":""},14100075,14110025,{"$f":"\"\"","v":""},{"$f":"\"\"","v":""},{"$f":"\"\"","v":""},"28004D",{"$f":"\"\"","v":""},"C","C",{"$f":"\"\"","v":""},null,{"$f":"\"\"","v":""}]
[]
[]
[]
[]
[]
[]
[]
[]
[]
[]
[]
[{"$f":"\"\"","v":""},{"$f":"\"\"","v":""},{"$f":"\"\"","v":""},{"$f":"\"\"","v":""},{"$f":"\"\"","v":""},{"$f":"\"\"","v":""},{"$f":"\"\"","v":""},{"$f":"\"\"","v":""},{"$f":"\"\"","v":""},{"$f":"\"\"","v":""},{"$f":"\"\"","v":""},{"$f":"\"\"","v":""},{"$f":"\"\"","v":""},{"$f":"\"\"","v":""},{"$f":"\"\"","v":""},{"$f":"\"\"","v":""},null,{"$f":"\"\"","v":""},{"$f":"\"\"","v":""},{"$f":"\"\"","v":""},{"$f":"\"\"","v":""},{"$f":"\"\"","v":""},{"$f":"\"\"","v":""},"C","C",{"$f":"\"\"","v":""},null,{"$f":"\"\"","v":""}]
[null,null,"Sub","Valve","Hose Kit"]
["Farmall 75C (Turkish Built)",{"$f":"\"\"","v":""},14327577,{"$f":"\"\"","v":""},{"$f":"\"\"","v":""},{"$f":"\"\"","v":""},{"$f":"\"\"","v":""},{"$f":"\"\"","v":""},{"$f":"\"\"","v":""},{"$f":"\"\"","v":""},{"$f":"\"\"","v":""},{"$f":"\"\"","v":""},{"$f":"\"\"","v":""},{"$f":"\"\"","v":""},{"$f":"\"\"","v":""},{"$f":"\"\"","v":""},{"$f":"\"\"","v":""},{"$f":"\"\"","v":""},{"$f":"\"\"","v":""},{"$f":"\"\"","v":""},{"$f":"\"\"","v":""},{"$f":"\"\"","v":""},{"$f":"\"\"","v":""},"C","C",{"$f":"\"\"","v":""},null,{"$f":"\"\"","v":""}]
["Farmall 85C, 95C,105C,115C EP (Turkish Built)",{"$f":"\"\"","v":""},14327097,{"$f":"\"\"","v":""},{"$f":"\"\"","v":""},{"$f":"\"\"","v":""},{"$f":"\"\"","v":""},{"$f":"\"\"","v":""},{"$f":"\"\"","v":""},{"$f":"\"\"","v":""},{"$f":"\"\"","v":""},{"$f":"\"\"","v":""},{"$f":"\"\"","v":""},{"$f":"\"\"","v":""},{"$f":"\"\"","v":""},{"$f":"\"\"","v":""},{"$f":"\"\"","v":""},{"$f":"\"\"","v":""},{"$f":"\"\"","v":""},{"$f":"\"\"","v":""},{"$f":"\"\"","v":""},{"$f":"\"\"","v":""},{"$f":"\"\"","v":""},"C","C",{"$f":"\"\"","v":""},null,{"$f":"\"\"","v":""}]
["Farmall 105U, 115U EP (Tier 4A)",{"$f":"\"\"","v":""},14327177,{"$f":"\"\"","v":""},{"$f":"\"\"","v":""},{"$f":"\"\"","v":""},{"$f":"\"\"","v":""},{"$f":"\"\"","v":""},{"$f":"\"\"","v":""},{"$f":"\"\"","v":""},{"$f":"\"\"","v":""},{"$f":"\"\"","v":""},{"$f":"\"\"","v":""},{"$f":"\"\"","v":""},{"$f":"\"\"","v":""},{"$f":"\"\"","v":""},{"$f":"\"\"","v":""},{"$f":"\"\"","v":""},{"$f":"\"\"","v":""},{"$f":"\"\"","v":""},{"$f":"\"\"","v":""},{"$f":"\"\"","v":""},{"$f":"\"\"","v":""},{"$f":"\"\"","v":""},{"$f":"\"\"","v":""},{"$f":"\"\"","v":""},{"$f":"\"\"","v":""},{"$f":"\"\"","v":""}]
["Farmall 110A, 120A, 125A, 140A",{"$f":"\"\"","v":""},14327617,{"$f":"\"\"","v":""},{"$f":"\"\"","v":""},{"$f":"\"\"","v":""},{"$f":"\"\"","v":""},{"$f":"\"\"","v":""},{"$f":"\"\"","v":""},{"$f":"\"\"","v":""},{"$f":"\"\"","v":""},{"$f":"\"\"","v":""},{"$f":"\"\"","v":""},{"$f":"\"\"","v":""},{"$f":"\"\"","v":""},{"$f":"\"\"","v":""},{"$f":"\"\"","v":""},{"$f":"\"\"","v":""},{"$f":"\"\"","v":""},{"$f":"\"\"","v":""},{"$f":"\"\"","v":""},{"$f":"\"\"","v":""},{"$f":"\"\"","v":""},{"$f":"\"\"","v":""},{"$f":"\"\"","v":""},{"$f":"\"\"","v":""},{"$f":"\"\"","v":""},{"$f":"\"\"","v":""}]
["Maxxum 110, 120, 130 EP",{"$f":"\"\"","v":""},14324847,{"$f":"\"\"","v":""},{"$f":"\"\"","v":""},{"$f":"\"\"","v":""},{"$f":"\"\"","v":""},{"$f":"\"\"","v":""},{"$f":"\"\"","v":""},{"$f":"\"\"","v":""},{"$f":"\"\"","v":""},{"$f":"\"\"","v":""},{"$f":"\"\"","v":""},{"$f":"\"\"","v":""},{"$f":"\"\"","v":""},{"$f":"\"\"","v":""},{"$f":"\"\"","v":""},{"$f":"\"\"","v":""},{"$f":"\"\"","v":""},{"$f":"\"\"","v":""},{"$f":"\"\"","v":""},{"$f":"\"\"","v":""},{"$f":"\"\"","v":""},{"$f":"\"\"","v":""},{"$f":"\"\"","v":""},{"$f":"\"\"","v":""},{"$f":"\"\"","v":""},{"$f":"\"\"","v":""}]
["Maxxum 115, 125, 140 EP",{"$f":"\"\"","v":""},14324857,{"$f":"\"\"","v":""},{"$f":"\"\"","v":""},{"$f":"\"\"","v":""},{"$f":"\"\"","v":""},{"$f":"\"\"","v":""},{"$f":"\"\"","v":""},{"$f":"\"\"","v":""},{"$f":"\"\"","v":""},{"$f":"\"\"","v":""},{"$f":"\"\"","v":""},{"$f":"\"\"","v":""},{"$f":"\"\"","v":""},{"$f":"\"\"","v":""},{"$f":"\"\"","v":""},{"$f":"\"\"","v":""},{"$f":"\"\"","v":""},{"$f":"\"\"","v":""},{"$f":"\"\"","v":""},{"$f":"\"\"","v":""},{"$f":"\"\"","v":""},{"$f":"\"\"","v":""},{"$f":"\"\"","v":""},{"$f":"\"\"","v":""},{"$f":"\"\"","v":""},{"$f":"\"\"","v":""}]
["Puma 115,125,140,155 ",{"$f":"\"\"","v":""},14324857,{"$f":"\"\"","v":""},{"$f":"\"\"","v":""},{"$f":"\"\"","v":""},{"$f":"\"\"","v":""},{"$f":"\"\"","v":""},{"$f":"\"\"","v":""},{"$f":"\"\"","v":""},{"$f":"\"\"","v":""},{"$f":"\"\"","v":""},{"$f":"\"\"","v":""},{"$f":"\"\"","v":""},{"$f":"\"\"","v":""},{"$f":"\"\"","v":""},{"$f":"\"\"","v":""},{"$f":"\"\"","v":""},{"$f":"\"\"","v":""},{"$f":"\"\"","v":""},{"$f":"\"\"","v":""},{"$f":"\"\"","v":""},{"$f":"\"\"","v":""},{"$f":"\"\"","v":""},{"$f":"\"\"","v":""},{"$f":"\"\"","v":""},{"$f":"\"\"","v":""},{"$f":"\"\"","v":""}]
["Puma 130, 145, 160 EP, +CVT",{"$f":"\"\"","v":""},14324857,{"$f":"\"\"","v":""},{"$f":"\"\"","v":""},{"$f":"\"\"","v":""},{"$f":"\"\"","v":""},{"$f":"\"\"","v":""},{"$f":"\"\"","v":""},{"$f":"\"\"","v":""},{"$f":"\"\"","v":""},{"$f":"\"\"","v":""},{"$f":"\"\"","v":""},{"$f":"\"\"","v":""},{"$f":"\"\"","v":""},{"$f":"\"\"","v":""},{"$f":"\"\"","v":""},{"$f":"\"\"","v":""},{"$f":"\"\"","v":""},{"$f":"\"\"","v":""},{"$f":"\"\"","v":""},{"$f":"\"\"","v":""},{"$f":"\"\"","v":""},{"$f":"\"\"","v":""},{"$f":"\"\"","v":""},{"$f":"\"\"","v":""},{"$f":"\"\"","v":""},{"$f":"\"\"","v":""}]
["Puma 165,180,195,210,225 ",{"$f":"\"\"","v":""},14327927,{"$f":"\"\"","v":""},{"$f":"\"\"","v":""},{"$f":"\"\"","v":""},{"$f":"\"\"","v":""},{"$f":"\"\"","v":""},{"$f":"\"\"","v":""},{"$f":"\"\"","v":""},{"$f":"\"\"","v":""},{"$f":"\"\"","v":""},{"$f":"\"\"","v":""},{"$f":"\"\"","v":""},{"$f":"\"\"","v":""},{"$f":"\"\"","v":""},{"$f":"\"\"","v":""},{"$f":"\"\"","v":""},{"$f":"\"\"","v":""},{"$f":"\"\"","v":""},{"$f":"\"\"","v":""},{"$f":"\"\"","v":""},{"$f":"\"\"","v":""},{"$f":"\"\"","v":""},{"$f":"\"\"","v":""},{"$f":"\"\"","v":""},{"$f":"\"\"","v":""},{"$f":"\"\"","v":""}]
["Puma Tier 4A 130 - 230 EP",{"$f":"\"\"","v":""},14327927,{"$f":"\"\"","v":""},{"$f":"\"\"","v":""},{"$f":"\"\"","v":""},{"$f":"\"\"","v":""},{"$f":"\"\"","v":""},{"$f":"\"\"","v":""},{"$f":"\"\"","v":""},{"$f":"\"\"","v":""},{"$f":"\"\"","v":""},{"$f":"\"\"","v":""},{"$f":"\"\"","v":""},{"$f":"\"\"","v":""},{"$f":"\"\"","v":""},{"$f":"\"\"","v":""},{"$f":"\"\"","v":""},{"$f":"\"\"","v":""},{"$f":"\"\"","v":""},{"$f":"\"\"","v":""},{"$f":"\"\"","v":""},{"$f":"\"\"","v":""},{"$f":"\"\"","v":""},{"$f":"\"\"","v":""},{"$f":"\"\"","v":""},{"$f":"\"\"","v":""},{"$f":"\"\"","v":""}]
[]
[]
[]
["Powerstar T4.75",{"$f":"\"\"","v":""},14327577,{"$f":"\"\"","v":""},{"$f":"\"\"","v":""},{"$f":"\"\"","v":""},{"$f":"\"\"","v":""},{"$f":"\"\"","v":""},{"$f":"\"\"","v":""},{"$f":"\"\"","v":""},{"$f":"\"\"","v":""},{"$f":"\"\"","v":""},{"$f":"\"\"","v":""},{"$f":"\"\"","v":""},{"$f":"\"\"","v":""},{"$f":"\"\"","v":""},{"$f":"\"\"","v":""},{"$f":"\"\"","v":""},{"$f":"\"\"","v":""},{"$f":"\"\"","v":""},{"$f":"\"\"","v":""},{"$f":"\"\"","v":""},{"$f":"\"\"","v":""},{"$f":"\"\"","v":""},{"$f":"\"\"","v":""},{"$f":"\"\"","v":""},{"$f":"\"\"","v":""},{"$f":"\"\"","v":""}]
["T4.85,95,105,115 EP",{"$f":"\"\"","v":""},14327097,{"$f":"\"\"","v":""},{"$f":"\"\"","v":""},{"$f":"\"\"","v":""},{"$f":"\"\"","v":""},{"$f":"\"\"","v":""},{"$f":"\"\"","v":""},{"$f":"\"\"","v":""},{"$f":"\"\"","v":""},{"$f":"\"\"","v":""},{"$f":"\"\"","v":""},{"$f":"\"\"","v":""},{"$f":"\"\"","v":""},{"$f":"\"\"","v":""},{"$f":"\"\"","v":""},{"$f":"\"\"","v":""},{"$f":"\"\"","v":""},{"$f":"\"\"","v":""},{"$f":"\"\"","v":""},{"$f":"\"\"","v":""},{"$f":"\"\"","v":""},{"$f":"\"\"","v":""},{"$f":"\"\"","v":""},{"$f":"\"\"","v":""},{"$f":"\"\"","v":""},{"$f":"\"\"","v":""}]
["T5.95, 105,115 EP",{"$f":"\"\"","v":""},14327177,{"$f":"\"\"","v":""},{"$f":"\"\"","v":""},{"$f":"\"\"","v":""},{"$f":"\"\"","v":""},{"$f":"\"\"","v":""},{"$f":"\"\"","v":""},{"$f":"\"\"","v":""},{"$f":"\"\"","v":""},{"$f":"\"\"","v":""},{"$f":"\"\"","v":""},{"$f":"\"\"","v":""},{"$f":"\"\"","v":""},{"$f":"\"\"","v":""},{"$f":"\"\"","v":""},{"$f":"\"\"","v":""},{"$f":"\"\"","v":""},{"$f":"\"\"","v":""},{"$f":"\"\"","v":""},{"$f":"\"\"","v":""},{"$f":"\"\"","v":""},{"$f":"\"\"","v":""},{"$f":"\"\"","v":""},{"$f":"\"\"","v":""},{"$f":"\"\"","v":""},{"$f":"\"\"","v":""}]
["T6.120, .140, .150, .160",null,14324847,null,null,null,null,null,null,null,null,null,null,null,null,null,null,null,null,null,null,null,null,null,null,null,{"$f":"\"\"","v":""}]
["T6.155, .165, .175",null,14324857,null,null,null,null,null,null,null,null,null,null,null,null,null,null,null,null,null,null,null,null,null,null,null,{"$f":"\"\"","v":""}]
["TS6.110,6.120,TS6.125,6.140",null,14327617,null,null,null,null,null,null,null,null,null,null,null,null,null,null,null,null,null,null,null,null,null,null,null,{"$f":"\"\"","v":""}]
["T6.140, 150, 155, 165,175, 260, + Supersteer EP",null,14324847,null,null,null,null,null,null,null,null,null,null,null,null,null,null,null,null,null,null,null,null,null,null,null,{"$f":"\"\"","v":""}]
["T7.170, .185, .200, .210, .235 EP",null,14327927,null,null,null,null,null,null,null,null,null,null,null,null,null,null,null,null,null,null,null,null,null,null,null,{"$f":"\"\"","v":""}]
["T7.220, .235, .250, .260, .270 EP",null,14327927,null,null,null,null,null,null,null,null,null,null,null,null,null,null,null,null,null,null,null,null,null,null,null,{"$f":"\"\"","v":""}]
[]
[null,null,null,null,null,null,null,null,null,null,null,null,null,null,null,null,null,null,null,null,null,null,null,null,null,null,{"$f":"\"\"","v":""}]
[null,null,null,null,null,null,null,null,null,null,null,null,null,null,null,null,null,null,null,null,null,null,null,null,null,null,{"$f":"\"\"","v":""}]

{"sheet":"OEM","index":8,"n_rows":48,"n_cols":2,"rows_kept":48,"cut":false,"hidden":true,"merged":[]}
["Farmall 75C (Turkish Built) T4","MUST BE SOURCED THROUGH CNH"]
["Farmall 85C, 95C,105C,115C EP T4","MUST BE SOURCED THROUGH CNH"]
["Farmall 45A,50A,60A,70A T4","MUST BE SOURCED THROUGH CNH"]
["Farmall 65C-120C T4","MUST BE SOURCED THROUGH CNH"]
["Farmall 85U, 95U, 105U, 115U EP T4","MUST BE SOURCED THROUGH CNH"]
["Farmall 110A, 120A, 125A, 140A T4","MUST BE SOURCED THROUGH CNH"]
["Maxxum 115, 125,135,145,150 T4","MUST BE SOURCED THROUGH CNH"]
["Puma 150,165,185,200,220,240 T4","MUST BE SOURCED THROUGH CNH"]
["Optum 270,300","MUST BE SOURCED THROUGH CNH"]
["Magnum 180-240 T4","MUST BE SOURCED THROUGH CNH"]
["Magnum 250-380 T4","MUST BE SOURCED THROUGH CNH"]
[]
[]
[]
[]
[]
["MT555D - MT575D Auto VI (Classic Cab)","MUST BE SOURCED THROUGH AGCO"]
["MT555D - MT575D Auto VI (Deluxe)","MUST BE SOURCED THROUGH AGCO"]
["MT555D, MT565D, MT575D CVT (Deluxe)","MUST BE SOURCED THROUGH AGCO"]
["MT585D, MT595D Auto VI (Classic Cab)","MUST BE SOURCED THROUGH AGCO"]
["MT585D, MT595D Auto VI (Deluxe)","MUST BE SOURCED THROUGH AGCO"]
["MT585D CVT (Deluxe)","MUST BE SOURCED THROUGH AGCO"]
["MT645C, 655C, 665C, 675C CVT ","MUST BE SOURCED THROUGH AGCO"]
["MT645D, 655D, 665D, 675D","MUST BE SOURCED THROUGH AGCO"]
["2605, 2615, 2625, 2635","MUST BE SOURCED THROUGH AGCO"]
["4608, 4609, 4610","MUST BE SOURCED THROUGH AGCO"]
[]
["5609, 5610, 5611, 5612, 5613","MUST BE SOURCED THROUGH AGCO"]
["6614, 6615, 6616","MUST BE SOURCED THROUGH AGCO"]
["7619, 7620, 7622 DYNA IV Classic Cab","MUST BE SOURCED THROUGH AGCO"]
["7619, 7620, 7622 DYNA IV Deluxe & Premium","MUST BE SOURCED THROUGH AGCO"]
["7619, 7620, 7622 CVT Deluxe & Premium","MUST BE SOURCED THROUGH AGCO"]
["7624, 7626 DYNA IV Classic Cab","MUST BE SOURCED THROUGH AGCO"]
["7624, 7626 DYNA IV Deluxe & Premium","MUST BE SOURCED THROUGH AGCO"]
["7624 CVT Deluxe & Premium Cab","MUST BE SOURCED THROUGH AGCO"]
["8650, 8660, 8670, 8680 TIER 3 and Tier 4i","MUST BE SOURCED THROUGH AGCO"]
["Workmaster 45, 50, 55, 60, 70","MUST BE SOURCED THROUGH CNH"]
["Powerstar T4.65, T4.75 T4B","MUST BE SOURCED THROUGH CNH"]
["T4.85 - 120 T4","MUST BE SOURCED THROUGH CNH"]
["T5.95 - 120 T4","MUST BE SOURCED THROUGH CNH"]
["T6.120, .140, .150, .160","MUST BE SOURCED THROUGH CNH"]
["T6.155, .165, .175","MUST BE SOURCED THROUGH CNH"]
["T7.170, .185, .200, .210, .235 EP","MUST BE SOURCED THROUGH CNH"]
["T7.220, .235, .250, .260, .270 EP","MUST BE SOURCED THROUGH CNH"]
["T8.275, .300, .330, .360, .390, .420","MUST BE SOURCED THROUGH CNH"]
[null,"MUST BE SOURCED THROUGH CNH"]
[null,"MUST BE SOURCED THROUGH CNH"]
[null,"MUST BE SOURCED THROUGH CNH"]

{"sheet":"AGCO","index":9,"n_rows":201,"n_cols":1,"rows_kept":201,"cut":false,"hidden":true,"merged":[]}
["GT45, 55 and \"A\""]
["GT55 and \"A\""]
["GT65, 75 and \"A\""]
["GT75 and \"A\""]
["LT75, 90"]
["LT \"A\" 75, 85, 90, 95 AUTO IV TIER II and III"]
["LT \"A\" 75, 90 Speed Shift"]
["RT 100, 120 Auto Quad"]
["RT 100, 120 Dyna VT"]
["RT 135, 150 Auto Quad"]
["RT 135, 150 Dyna VT"]
["RT \"A\" 100, 120 TIER 2 Auto IV"]
["RT \"A\" 100, 120 TIER 2 CVT"]
["RT \"A\" 140, 155 TIER 2 Auto IV"]
["RT \"A\" 140, 155 TIER 2 CVT"]
["RT \"A\" 110, 120 TIER 3 Auto VI"]
["RT \"A\" 110, 120 TIER 3 CVT"]
["RT \"A\" 140, 155 TIER 3 Auto VI"]
["RT \"A\" 140, 155 TIER 3 CVT"]
["RT 165A AUTO VI Tier 3 Serial # <T176049"]
["RT 165A AUTO VI Tier 3 Serial # >T189041"]
["RT 165A Tier 3 CVT"]
["RT 180A from serial # T198034"]
["RT 180A Tier 3 CVT"]
["DT \"A\" 180, 200, 220, 240"]
["DT \"B\" 205, 225, 250, 275"]
["LT70, 85 ROPS"]
["LT70, 85 CAB"]
["RT95, 115"]
["RT 130, 145"]
[{"$f":"\"\"","v":""}]
[{"$f":"\"\"","v":""}]
[{"$f":"\"\"","v":""}]
[{"$f":"\"\"","v":""}]
[{"$f":"\"\"","v":""}]
[{"$f":"\"\"","v":""}]
[{"$f":"\"\"","v":""}]
[{"$f":"\"\"","v":""}]
[{"$f":"\"\"","v":""}]
[{"$f":"\"\"","v":""}]
[{"$f":"\"\"","v":""}]
[{"$f":"\"\"","v":""}]
[{"$f":"\"\"","v":""}]
[{"$f":"\"\"","v":""}]
[{"$f":"\"\"","v":""}]
[{"$f":"\"\"","v":""}]
[{"$f":"\"\"","v":""}]
[{"$f":"\"\"","v":""}]
[{"$f":"\"\"","v":""}]
[{"$f":"\"\"","v":""}]
[{"$f":"\"\"","v":""}]
[{"$f":"\"\"","v":""}]
[{"$f":"\"\"","v":""}]
[{"$f":"\"\"","v":""}]
[{"$f":"\"\"","v":""}]
[{"$f":"\"\"","v":""}]
[{"$f":"\"\"","v":""}]
[{"$f":"\"\"","v":""}]
[{"$f":"\"\"","v":""}]
[{"$f":"\"\"","v":""}]
[{"$f":"\"\"","v":""}]
[{"$f":"\"\"","v":""}]
[{"$f":"\"\"","v":""}]
[{"$f":"\"\"","v":""}]
[{"$f":"\"\"","v":""}]
[{"$f":"\"\"","v":""}]
[{"$f":"\"\"","v":""}]
[{"$f":"\"\"","v":""}]
[{"$f":"\"\"","v":""}]
[{"$f":"\"\"","v":""}]
[{"$f":"\"\"","v":""}]
[{"$f":"\"\"","v":""}]
[{"$f":"\"\"","v":""}]
[{"$f":"\"\"","v":""}]
[{"$f":"\"\"","v":""}]
[{"$f":"\"\"","v":""}]
[{"$f":"\"\"","v":""}]
[{"$f":"\"\"","v":""}]
[{"$f":"\"\"","v":""}]
[{"$f":"\"\"","v":""}]
[{"$f":"\"\"","v":""}]
[{"$f":"\"\"","v":""}]
[{"$f":"\"\"","v":""}]
[{"$f":"\"\"","v":""}]
[{"$f":"\"\"","v":""}]
[{"$f":"\"\"","v":""}]
[{"$f":"\"\"","v":""}]
[{"$f":"\"\"","v":""}]
[{"$f":"\"\"","v":""}]
[{"$f":"\"\"","v":""}]
[{"$f":"\"\"","v":""}]
[{"$f":"\"\"","v":""}]
[{"$f":"\"\"","v":""}]
[{"$f":"\"\"","v":""}]
[{"$f":"\"\"","v":""}]
[{"$f":"\"\"","v":""}]
[{"$f":"\"\"","v":""}]
[{"$f":"\"\"","v":""}]
[{"$f":"\"\"","v":""}]
[{"$f":"\"\"","v":""}]
[{"$f":"\"\"","v":""}]
[{"$f":"\"\"","v":""}]
[{"$f":"\"\"","v":""}]
[{"$f":"\"\"","v":""}]
[{"$f":"\"\"","v":""}]
[{"$f":"\"\"","v":""}]
[{"$f":"\"\"","v":""}]
[{"$f":"\"\"","v":""}]
[{"$f":"\"\"","v":""}]
[{"$f":"\"\"","v":""}]
[{"$f":"\"\"","v":""}]
[{"$f":"\"\"","v":""}]
[{"$f":"\"\"","v":""}]
[{"$f":"\"\"","v":""}]
[{"$f":"\"\"","v":""}]
[{"$f":"\"\"","v":""}]
[{"$f":"\"\"","v":""}]
[{"$f":"\"\"","v":""}]
[{"$f":"\"\"","v":""}]
[{"$f":"\"\"","v":""}]
[{"$f":"\"\"","v":""}]
[{"$f":"\"\"","v":""}]
[{"$f":"\"\"","v":""}]
[{"$f":"\"\"","v":""}]
[{"$f":"\"\"","v":""}]
[{"$f":"\"\"","v":""}]
[{"$f":"\"\"","v":""}]
[{"$f":"\"\"","v":""}]
[{"$f":"\"\"","v":""}]
[{"$f":"\"\"","v":""}]
[{"$f":"\"\"","v":""}]
[{"$f":"\"\"","v":""}]
[{"$f":"\"\"","v":""}]
[{"$f":"\"\"","v":""}]
[{"$f":"\"\"","v":""}]
[{"$f":"\"\"","v":""}]
[{"$f":"\"\"","v":""}]
[{"$f":"\"\"","v":""}]
[{"$f":"\"\"","v":""}]
[{"$f":"\"\"","v":""}]
[{"$f":"\"\"","v":""}]
[{"$f":"\"\"","v":""}]
[{"$f":"\"\"","v":""}]
[{"$f":"\"\"","v":""}]
[{"$f":"\"\"","v":""}]
[{"$f":"\"\"","v":""}]
[{"$f":"\"\"","v":""}]
[{"$f":"\"\"","v":""}]
[{"$f":"\"\"","v":""}]
[{"$f":"\"\"","v":""}]
[{"$f":"\"\"","v":""}]
[{"$f":"\"\"","v":""}]
[{"$f":"\"\"","v":""}]
[{"$f":"\"\"","v":""}]
[{"$f":"\"\"","v":""}]
[{"$f":"\"\"","v":""}]
[{"$f":"\"\"","v":""}]
[{"$f":"\"\"","v":""}]
[{"$f":"\"\"","v":""}]
[{"$f":"\"\"","v":""}]
[{"$f":"\"\"","v":""}]
[{"$f":"\"\"","v":""}]
[{"$f":"\"\"","v":""}]
[{"$f":"\"\"","v":""}]
[{"$f":"\"\"","v":""}]
[{"$f":"\"\"","v":""}]
[{"$f":"\"\"","v":""}]
[{"$f":"\"\"","v":""}]
[{"$f":"\"\"","v":""}]
[{"$f":"\"\"","v":""}]
[{"$f":"\"\"","v":""}]
[{"$f":"\"\"","v":""}]
[{"$f":"\"\"","v":""}]
[{"$f":"\"\"","v":""}]
[{"$f":"\"\"","v":""}]
[{"$f":"\"\"","v":""}]
[{"$f":"\"\"","v":""}]
[{"$f":"\"\"","v":""}]
[{"$f":"\"\"","v":""}]
[{"$f":"\"\"","v":""}]
[{"$f":"\"\"","v":""}]
[{"$f":"\"\"","v":""}]
[{"$f":"\"\"","v":""}]
[{"$f":"\"\"","v":""}]
[{"$f":"\"\"","v":""}]
[{"$f":"\"\"","v":""}]
[{"$f":"\"\"","v":""}]
[{"$f":"\"\"","v":""}]
[{"$f":"\"\"","v":""}]
[{"$f":"\"\"","v":""}]
[{"$f":"\"\"","v":""}]
[{"$f":"\"\"","v":""}]
[{"$f":"\"\"","v":""}]
[{"$f":"\"\"","v":""}]
[{"$f":"\"\"","v":""}]
[{"$f":"\"\"","v":""}]
[{"$f":"\"\"","v":""}]
[{"$f":"\"\"","v":""}]
[{"$f":"\"\"","v":""}]
[{"$f":"\"\"","v":""}]
[{"$f":"\"\"","v":""}]

{"sheet":"AGCO Allis","index":10,"n_rows":172,"n_cols":1,"rows_kept":172,"cut":false,"hidden":true,"merged":[]}
["8745, 8765 (Valtra Engine)"]
["8745, 8765 (Cummins Engine)"]
["8745, 8765 (Cummins Engine)"]
["8775, 8785 (Valtra Engine)"]
["8775, 8785 (Cummins Engine)"]
["4650, 4660 "]
["5650, 5660"]
["5670, 5680"]
["8610, 8630"]
[{"$f":"\"\"","v":""}]
[{"$f":"\"\"","v":""}]
[{"$f":"\"\"","v":""}]
[{"$f":"\"\"","v":""}]
[{"$f":"\"\"","v":""}]
[{"$f":"\"\"","v":""}]
[{"$f":"\"\"","v":""}]
[{"$f":"\"\"","v":""}]
[{"$f":"\"\"","v":""}]
[{"$f":"\"\"","v":""}]
[{"$f":"\"\"","v":""}]
[{"$f":"\"\"","v":""}]
[{"$f":"\"\"","v":""}]
[{"$f":"\"\"","v":""}]
[{"$f":"\"\"","v":""}]
[{"$f":"\"\"","v":""}]
[{"$f":"\"\"","v":""}]
[{"$f":"\"\"","v":""}]
[{"$f":"\"\"","v":""}]
[{"$f":"\"\"","v":""}]
[{"$f":"\"\"","v":""}]
[{"$f":"\"\"","v":""}]
[{"$f":"\"\"","v":""}]
[{"$f":"\"\"","v":""}]
[{"$f":"\"\"","v":""}]
[{"$f":"\"\"","v":""}]
[{"$f":"\"\"","v":""}]
[{"$f":"\"\"","v":""}]
[{"$f":"\"\"","v":""}]
[{"$f":"\"\"","v":""}]
[{"$f":"\"\"","v":""}]
[{"$f":"\"\"","v":""}]
[{"$f":"\"\"","v":""}]
[{"$f":"\"\"","v":""}]
[{"$f":"\"\"","v":""}]
[{"$f":"\"\"","v":""}]
[{"$f":"\"\"","v":""}]
[{"$f":"\"\"","v":""}]
[{"$f":"\"\"","v":""}]
[{"$f":"\"\"","v":""}]
[{"$f":"\"\"","v":""}]
[{"$f":"\"\"","v":""}]
[{"$f":"\"\"","v":""}]
[{"$f":"\"\"","v":""}]
[{"$f":"\"\"","v":""}]
[{"$f":"\"\"","v":""}]
[{"$f":"\"\"","v":""}]
[{"$f":"\"\"","v":""}]
[{"$f":"\"\"","v":""}]
[{"$f":"\"\"","v":""}]
[{"$f":"\"\"","v":""}]
[{"$f":"\"\"","v":""}]
[{"$f":"\"\"","v":""}]
[{"$f":"\"\"","v":""}]
[{"$f":"\"\"","v":""}]
[{"$f":"\"\"","v":""}]
[{"$f":"\"\"","v":""}]
[{"$f":"\"\"","v":""}]
[{"$f":"\"\"","v":""}]
[{"$f":"\"\"","v":""}]
[{"$f":"\"\"","v":""}]
[{"$f":"\"\"","v":""}]
[{"$f":"\"\"","v":""}]
[{"$f":"\"\"","v":""}]
[{"$f":"\"\"","v":""}]
[{"$f":"\"\"","v":""}]
[{"$f":"\"\"","v":""}]
[{"$f":"\"\"","v":""}]
[{"$f":"\"\"","v":""}]
[{"$f":"\"\"","v":""}]
[{"$f":"\"\"","v":""}]
[{"$f":"\"\"","v":""}]
[{"$f":"\"\"","v":""}]
[{"$f":"\"\"","v":""}]
[{"$f":"\"\"","v":""}]
[{"$f":"\"\"","v":""}]
[{"$f":"\"\"","v":""}]
[{"$f":"\"\"","v":""}]
[{"$f":"\"\"","v":""}]
[{"$f":"\"\"","v":""}]
[{"$f":"\"\"","v":""}]
[{"$f":"\"\"","v":""}]
[{"$f":"\"\"","v":""}]
[{"$f":"\"\"","v":""}]
[{"$f":"\"\"","v":""}]
[{"$f":"\"\"","v":""}]
[{"$f":"\"\"","v":""}]
[{"$f":"\"\"","v":""}]
[{"$f":"\"\"","v":""}]
[{"$f":"\"\"","v":""}]
[{"$f":"\"\"","v":""}]
[{"$f":"\"\"","v":""}]
[{"$f":"\"\"","v":""}]
[{"$f":"\"\"","v":""}]
[{"$f":"\"\"","v":""}]
[{"$f":"\"\"","v":""}]
[{"$f":"\"\"","v":""}]
[{"$f":"\"\"","v":""}]
[{"$f":"\"\"","v":""}]
[{"$f":"\"\"","v":""}]
[{"$f":"\"\"","v":""}]
[{"$f":"\"\"","v":""}]
[{"$f":"\"\"","v":""}]
[{"$f":"\"\"","v":""}]
[{"$f":"\"\"","v":""}]
[{"$f":"\"\"","v":""}]
[{"$f":"\"\"","v":""}]
[{"$f":"\"\"","v":""}]
[{"$f":"\"\"","v":""}]
[{"$f":"\"\"","v":""}]
[{"$f":"\"\"","v":""}]
[{"$f":"\"\"","v":""}]
[{"$f":"\"\"","v":""}]
[{"$f":"\"\"","v":""}]
[{"$f":"\"\"","v":""}]
[{"$f":"\"\"","v":""}]
[{"$f":"\"\"","v":""}]
[{"$f":"\"\"","v":""}]
[{"$f":"\"\"","v":""}]
[{"$f":"\"\"","v":""}]
[{"$f":"\"\"","v":""}]
[{"$f":"\"\"","v":""}]
[{"$f":"\"\"","v":""}]
[{"$f":"\"\"","v":""}]
[{"$f":"\"\"","v":""}]
[{"$f":"\"\"","v":""}]
[{"$f":"\"\"","v":""}]
[{"$f":"\"\"","v":""}]
[{"$f":"\"\"","v":""}]
[{"$f":"\"\"","v":""}]
[{"$f":"\"\"","v":""}]
[{"$f":"\"\"","v":""}]
[{"$f":"\"\"","v":""}]
[{"$f":"\"\"","v":""}]
[{"$f":"\"\"","v":""}]
[{"$f":"\"\"","v":""}]
[{"$f":"\"\"","v":""}]
[{"$f":"\"\"","v":""}]
[{"$f":"\"\"","v":""}]
[{"$f":"\"\"","v":""}]
[{"$f":"\"\"","v":""}]
[{"$f":"\"\"","v":""}]
[{"$f":"\"\"","v":""}]
[{"$f":"\"\"","v":""}]
[{"$f":"\"\"","v":""}]
[{"$f":"\"\"","v":""}]
[{"$f":"\"\"","v":""}]
[{"$f":"\"\"","v":""}]
[{"$f":"\"\"","v":""}]
[{"$f":"\"\"","v":""}]
[{"$f":"\"\"","v":""}]
[{"$f":"\"\"","v":""}]
[{"$f":"\"\"","v":""}]
[{"$f":"\"\"","v":""}]
[{"$f":"\"\"","v":""}]
[{"$f":"\"\"","v":""}]
[{"$f":"\"\"","v":""}]
[{"$f":"\"\"","v":""}]
[{"$f":"\"\"","v":""}]
[{"$f":"\"\"","v":""}]
[{"$f":"\"\"","v":""}]
[{"$f":"\"\"","v":""}]
[{"$f":"\"\"","v":""}]

{"sheet":"AGCO White","index":11,"n_rows":171,"n_cols":1,"rows_kept":171,"cut":false,"hidden":true,"merged":[]}
["6410, 6510"]
["6410, 6510"]
["6710, 6810'"]
["8310, 8410"]
["6045 ROPS"]
["6065 ROPS"]
["6065 CAB"]
["6105 CAB"]
[{"$f":"\"\"","v":""}]
[{"$f":"\"\"","v":""}]
[{"$f":"\"\"","v":""}]
[{"$f":"\"\"","v":""}]
[{"$f":"\"\"","v":""}]
[{"$f":"\"\"","v":""}]
[{"$f":"\"\"","v":""}]
[{"$f":"\"\"","v":""}]
[{"$f":"\"\"","v":""}]
[{"$f":"\"\"","v":""}]
[{"$f":"\"\"","v":""}]
[{"$f":"\"\"","v":""}]
[{"$f":"\"\"","v":""}]
[{"$f":"\"\"","v":""}]
[{"$f":"\"\"","v":""}]
[{"$f":"\"\"","v":""}]
[{"$f":"\"\"","v":""}]
[{"$f":"\"\"","v":""}]
[{"$f":"\"\"","v":""}]
[{"$f":"\"\"","v":""}]
[{"$f":"\"\"","v":""}]
[{"$f":"\"\"","v":""}]
[{"$f":"\"\"","v":""}]
[{"$f":"\"\"","v":""}]
[{"$f":"\"\"","v":""}]
[{"$f":"\"\"","v":""}]
[{"$f":"\"\"","v":""}]
[{"$f":"\"\"","v":""}]
[{"$f":"\"\"","v":""}]
[{"$f":"\"\"","v":""}]
[{"$f":"\"\"","v":""}]
[{"$f":"\"\"","v":""}]
[{"$f":"\"\"","v":""}]
[{"$f":"\"\"","v":""}]
[{"$f":"\"\"","v":""}]
[{"$f":"\"\"","v":""}]
[{"$f":"\"\"","v":""}]
[{"$f":"\"\"","v":""}]
[{"$f":"\"\"","v":""}]
[{"$f":"\"\"","v":""}]
[{"$f":"\"\"","v":""}]
[{"$f":"\"\"","v":""}]
[{"$f":"\"\"","v":""}]
[{"$f":"\"\"","v":""}]
[{"$f":"\"\"","v":""}]
[{"$f":"\"\"","v":""}]
[{"$f":"\"\"","v":""}]
[{"$f":"\"\"","v":""}]
[{"$f":"\"\"","v":""}]
[{"$f":"\"\"","v":""}]
[{"$f":"\"\"","v":""}]
[{"$f":"\"\"","v":""}]
[{"$f":"\"\"","v":""}]
[{"$f":"\"\"","v":""}]
[{"$f":"\"\"","v":""}]
[{"$f":"\"\"","v":""}]
[{"$f":"\"\"","v":""}]
[{"$f":"\"\"","v":""}]
[{"$f":"\"\"","v":""}]
[{"$f":"\"\"","v":""}]
[{"$f":"\"\"","v":""}]
[{"$f":"\"\"","v":""}]
[{"$f":"\"\"","v":""}]
[{"$f":"\"\"","v":""}]
[{"$f":"\"\"","v":""}]
[{"$f":"\"\"","v":""}]
[{"$f":"\"\"","v":""}]
[{"$f":"\"\"","v":""}]
[{"$f":"\"\"","v":""}]
[{"$f":"\"\"","v":""}]
[{"$f":"\"\"","v":""}]
[{"$f":"\"\"","v":""}]
[{"$f":"\"\"","v":""}]
[{"$f":"\"\"","v":""}]
[{"$f":"\"\"","v":""}]
[{"$f":"\"\"","v":""}]
[{"$f":"\"\"","v":""}]
[{"$f":"\"\"","v":""}]
[{"$f":"\"\"","v":""}]
[{"$f":"\"\"","v":""}]
[{"$f":"\"\"","v":""}]
[{"$f":"\"\"","v":""}]
[{"$f":"\"\"","v":""}]
[{"$f":"\"\"","v":""}]
[{"$f":"\"\"","v":""}]
[{"$f":"\"\"","v":""}]
[{"$f":"\"\"","v":""}]
[{"$f":"\"\"","v":""}]
[{"$f":"\"\"","v":""}]
[{"$f":"\"\"","v":""}]
[{"$f":"\"\"","v":""}]
[{"$f":"\"\"","v":""}]
[{"$f":"\"\"","v":""}]
[{"$f":"\"\"","v":""}]
[{"$f":"\"\"","v":""}]
[{"$f":"\"\"","v":""}]
[{"$f":"\"\"","v":""}]
[{"$f":"\"\"","v":""}]
[{"$f":"\"\"","v":""}]
[{"$f":"\"\"","v":""}]
[{"$f":"\"\"","v":""}]
[{"$f":"\"\"","v":""}]
[{"$f":"\"\"","v":""}]
[{"$f":"\"\"","v":""}]
[{"$f":"\"\"","v":""}]
[{"$f":"\"\"","v":""}]
[{"$f":"\"\"","v":""}]
[{"$f":"\"\"","v":""}]
[{"$f":"\"\"","v":""}]
[{"$f":"\"\"","v":""}]
[{"$f":"\"\"","v":""}]
[{"$f":"\"\"","v":""}]
[{"$f":"\"\"","v":""}]
[{"$f":"\"\"","v":""}]
[{"$f":"\"\"","v":""}]
[{"$f":"\"\"","v":""}]
[{"$f":"\"\"","v":""}]
[{"$f":"\"\"","v":""}]
[{"$f":"\"\"","v":""}]
[{"$f":"\"\"","v":""}]
[{"$f":"\"\"","v":""}]
[{"$f":"\"\"","v":""}]
[{"$f":"\"\"","v":""}]
[{"$f":"\"\"","v":""}]
[{"$f":"\"\"","v":""}]
[{"$f":"\"\"","v":""}]
[{"$f":"\"\"","v":""}]
[{"$f":"\"\"","v":""}]
[{"$f":"\"\"","v":""}]
[{"$f":"\"\"","v":""}]
[{"$f":"\"\"","v":""}]
[{"$f":"\"\"","v":""}]
[{"$f":"\"\"","v":""}]
[{"$f":"\"\"","v":""}]
[{"$f":"\"\"","v":""}]
[{"$f":"\"\"","v":""}]
[{"$f":"\"\"","v":""}]
[{"$f":"\"\"","v":""}]
[{"$f":"\"\"","v":""}]
[{"$f":"\"\"","v":""}]
[{"$f":"\"\"","v":""}]
[{"$f":"\"\"","v":""}]
[{"$f":"\"\"","v":""}]
[{"$f":"\"\"","v":""}]
[{"$f":"\"\"","v":""}]
[{"$f":"\"\"","v":""}]
[{"$f":"\"\"","v":""}]
[{"$f":"\"\"","v":""}]
[{"$f":"\"\"","v":""}]
[{"$f":"\"\"","v":""}]
[{"$f":"\"\"","v":""}]
[{"$f":"\"\"","v":""}]
[{"$f":"\"\"","v":""}]
[{"$f":"\"\"","v":""}]
[{"$f":"\"\"","v":""}]
[{"$f":"\"\"","v":""}]
[{"$f":"\"\"","v":""}]
[{"$f":"\"\"","v":""}]
[{"$f":"\"\"","v":""}]
[{"$f":"\"\"","v":""}]
[{"$f":"\"\"","v":""}]
[{"$f":"\"\"","v":""}]
[{"$f":"\"\"","v":""}]

{"sheet":"Buhler","index":12,"n_rows":164,"n_cols":1,"rows_kept":164,"cut":false,"hidden":true,"merged":[]}
["Genesis 2145, 2160, 2180, 2210"]
[{"$f":"\"\"","v":""}]
[{"$f":"\"\"","v":""}]
[{"$f":"\"\"","v":""}]
[{"$f":"\"\"","v":""}]
[{"$f":"\"\"","v":""}]
[{"$f":"\"\"","v":""}]
[{"$f":"\"\"","v":""}]
[{"$f":"\"\"","v":""}]
[{"$f":"\"\"","v":""}]
[{"$f":"\"\"","v":""}]
[{"$f":"\"\"","v":""}]
[{"$f":"\"\"","v":""}]
[{"$f":"\"\"","v":""}]
[{"$f":"\"\"","v":""}]
[{"$f":"\"\"","v":""}]
[{"$f":"\"\"","v":""}]
[{"$f":"\"\"","v":""}]
[{"$f":"\"\"","v":""}]
[{"$f":"\"\"","v":""}]
[{"$f":"\"\"","v":""}]
[{"$f":"\"\"","v":""}]
[{"$f":"\"\"","v":""}]
[{"$f":"\"\"","v":""}]
[{"$f":"\"\"","v":""}]
[{"$f":"\"\"","v":""}]
[{"$f":"\"\"","v":""}]
[{"$f":"\"\"","v":""}]
[{"$f":"\"\"","v":""}]
[{"$f":"\"\"","v":""}]
[{"$f":"\"\"","v":""}]
[{"$f":"\"\"","v":""}]
[{"$f":"\"\"","v":""}]
[{"$f":"\"\"","v":""}]
[{"$f":"\"\"","v":""}]
[{"$f":"\"\"","v":""}]
[{"$f":"\"\"","v":""}]
[{"$f":"\"\"","v":""}]
[{"$f":"\"\"","v":""}]
[{"$f":"\"\"","v":""}]
[{"$f":"\"\"","v":""}]
[{"$f":"\"\"","v":""}]
[{"$f":"\"\"","v":""}]
[{"$f":"\"\"","v":""}]
[{"$f":"\"\"","v":""}]
[{"$f":"\"\"","v":""}]
[{"$f":"\"\"","v":""}]
[{"$f":"\"\"","v":""}]
[{"$f":"\"\"","v":""}]
[{"$f":"\"\"","v":""}]
[{"$f":"\"\"","v":""}]
[{"$f":"\"\"","v":""}]
[{"$f":"\"\"","v":""}]
[{"$f":"\"\"","v":""}]
[{"$f":"\"\"","v":""}]
[{"$f":"\"\"","v":""}]
[{"$f":"\"\"","v":""}]
[{"$f":"\"\"","v":""}]
[{"$f":"\"\"","v":""}]
[{"$f":"\"\"","v":""}]
[{"$f":"\"\"","v":""}]
[{"$f":"\"\"","v":""}]
[{"$f":"\"\"","v":""}]
[{"$f":"\"\"","v":""}]
[{"$f":"\"\"","v":""}]
[{"$f":"\"\"","v":""}]
[{"$f":"\"\"","v":""}]
[{"$f":"\"\"","v":""}]
[{"$f":"\"\"","v":""}]
[{"$f":"\"\"","v":""}]
[{"$f":"\"\"","v":""}]
[{"$f":"\"\"","v":""}]
[{"$f":"\"\"","v":""}]
[{"$f":"\"\"","v":""}]
[{"$f":"\"\"","v":""}]
[{"$f":"\"\"","v":""}]
[{"$f":"\"\"","v":""}]
[{"$f":"\"\"","v":""}]
[{"$f":"\"\"","v":""}]
[{"$f":"\"\"","v":""}]
[{"$f":"\"\"","v":""}]
[{"$f":"\"\"","v":""}]
[{"$f":"\"\"","v":""}]
[{"$f":"\"\"","v":""}]
[{"$f":"\"\"","v":""}]
[{"$f":"\"\"","v":""}]
[{"$f":"\"\"","v":""}]
[{"$f":"\"\"","v":""}]
[{"$f":"\"\"","v":""}]
[{"$f":"\"\"","v":""}]
[{"$f":"\"\"","v":""}]
[{"$f":"\"\"","v":""}]
[{"$f":"\"\"","v":""}]
[{"$f":"\"\"","v":""}]
[{"$f":"\"\"","v":""}]
[{"$f":"\"\"","v":""}]
[{"$f":"\"\"","v":""}]
[{"$f":"\"\"","v":""}]
[{"$f":"\"\"","v":""}]
[{"$f":"\"\"","v":""}]
[{"$f":"\"\"","v":""}]
[{"$f":"\"\"","v":""}]
[{"$f":"\"\"","v":""}]
[{"$f":"\"\"","v":""}]
[{"$f":"\"\"","v":""}]
[{"$f":"\"\"","v":""}]
[{"$f":"\"\"","v":""}]
[{"$f":"\"\"","v":""}]
[{"$f":"\"\"","v":""}]
[{"$f":"\"\"","v":""}]
[{"$f":"\"\"","v":""}]
[{"$f":"\"\"","v":""}]
[{"$f":"\"\"","v":""}]
[{"$f":"\"\"","v":""}]
[{"$f":"\"\"","v":""}]
[{"$f":"\"\"","v":""}]
[{"$f":"\"\"","v":""}]
[{"$f":"\"\"","v":""}]
[{"$f":"\"\"","v":""}]
[{"$f":"\"\"","v":""}]
[{"$f":"\"\"","v":""}]
[{"$f":"\"\"","v":""}]
[{"$f":"\"\"","v":""}]
[{"$f":"\"\"","v":""}]
[{"$f":"\"\"","v":""}]
[{"$f":"\"\"","v":""}]
[{"$f":"\"\"","v":""}]
[{"$f":"\"\"","v":""}]
[{"$f":"\"\"","v":""}]
[{"$f":"\"\"","v":""}]
[{"$f":"\"\"","v":""}]
[{"$f":"\"\"","v":""}]
[{"$f":"\"\"","v":""}]
[{"$f":"\"\"","v":""}]
[{"$f":"\"\"","v":""}]
[{"$f":"\"\"","v":""}]
[{"$f":"\"\"","v":""}]
[{"$f":"\"\"","v":""}]
[{"$f":"\"\"","v":""}]
[{"$f":"\"\"","v":""}]
[{"$f":"\"\"","v":""}]
[{"$f":"\"\"","v":""}]
[{"$f":"\"\"","v":""}]
[{"$f":"\"\"","v":""}]
[{"$f":"\"\"","v":""}]
[{"$f":"\"\"","v":""}]
[{"$f":"\"\"","v":""}]
[{"$f":"\"\"","v":""}]
[{"$f":"\"\"","v":""}]
[{"$f":"\"\"","v":""}]
[{"$f":"\"\"","v":""}]
[{"$f":"\"\"","v":""}]
[{"$f":"\"\"","v":""}]
[{"$f":"\"\"","v":""}]
[{"$f":"\"\"","v":""}]
[{"$f":"\"\"","v":""}]
[{"$f":"\"\"","v":""}]
[{"$f":"\"\"","v":""}]
[{"$f":"\"\"","v":""}]
[{"$f":"\"\"","v":""}]
[{"$f":"\"\"","v":""}]
[{"$f":"\"\"","v":""}]
[{"$f":"\"\"","v":""}]
[{"$f":"\"\"","v":""}]

{"sheet":"Case","index":13,"n_rows":218,"n_cols":1,"rows_kept":218,"cut":false,"hidden":true,"merged":[]}
["Farmall 75C (Turkish Built) T4"]
["Farmall 85C, 95C,105C,115C EP T4"]
["Farmall 45A,50A,60A,70A T4"]
["Farmall 65C-120C T4"]
["Farmall 85U, 95U, 105U, 115U EP T4"]
["Farmall 110A, 120A, 125A, 140A T4"]
["Maxxum 115, 125,135,145,150 T4"]
["Puma 150,165,185,200,220,240 T4"]
["Optum 270,300"]
["Magnum 180-240 T4"]
["Magnum 250-380 T4"]
["Farmall 65A, 75A"]
["Farmall 65C, 75C (Straddle Jesi)"]
["Farmall 85C, 95C (Straddle Jesi)"]
["Farmall 70, 80 "]
["Farmall 90, 95, JX95"]
["FARMALL 85U, 95U, 105U  (JESI)"]
["JX1080U, JX1090U, 1100U (JESI)"]
["JX55, 60, 65, 70"]
["JX75, 80, 85, 90"]
["JX1060C, 1070C, 1075C"]
["JX1085C, 1095C"]
["JX1075N, JX1095N"]
["JX70, 80, 90, 100U"]
["MXU 100, 110 Limited"]
["Maxxum 110, 120, 130 T3"]
["MXU 115, 130 Value (Open Center)"]
["MXU 115, 125, 135 Limited (Closed Center)"]
["Maxxum 115,125,140 T3"]
["MX 180 - 335"]
["Magnum 180 - 280 (Teir III)"]
["3230-4240, C70 - C100 4WD"]
["3230-4240, C70 - C100 2WD"]
["685-985 AND 695-995 4WD"]
["685-985 AND 695-995 2WD"]
["CX70, 80, 90, 100"]
["5130 - 5250 6 Cylinder"]
["MX80C - 100C"]
["MX100-135"]
["MX150-170"]
["MXM 130, 140 Value (Open Center)"]
["MXM 120, 130, 140, 155 Pro (Closed Center)"]
["MXM 175, 190 Pro"]
["Magnum 7110 - 7150 / 7210 - 7250 / 8910 - 8950"]
["5120'"]
["5220 4 Cylinder"]
["C50, C60, 3210, 3220"]
["CX50, CX60"]
[{"$f":"\"\"","v":""}]
["D35-45 / DX35-45 / FARMALL40-50 "]
["DX48, 55 / FARMALL 55, 60 "]
["DX25, DX 29, DX33, DX35"]
["DX29, 31, 33 FARMALL"]
["DX34 FARMALL"]
["FARMALL 30B, 35B "]
["FARMALL 40B, 50B "]
[{"$f":"\"\"","v":""}]
[{"$f":"\"\"","v":""}]
[{"$f":"\"\"","v":""}]
[{"$f":"\"\"","v":""}]
[{"$f":"\"\"","v":""}]
[{"$f":"\"\"","v":""}]
[{"$f":"\"\"","v":""}]
[{"$f":"\"\"","v":""}]
[{"$f":"\"\"","v":""}]
[{"$f":"\"\"","v":""}]
[{"$f":"\"\"","v":""}]
[{"$f":"\"\"","v":""}]
[{"$f":"\"\"","v":""}]
[{"$f":"\"\"","v":""}]
[{"$f":"\"\"","v":""}]
[{"$f":"\"\"","v":""}]
[{"$f":"\"\"","v":""}]
[{"$f":"\"\"","v":""}]
[{"$f":"\"\"","v":""}]
[{"$f":"\"\"","v":""}]
[{"$f":"\"\"","v":""}]
[{"$f":"\"\"","v":""}]
[{"$f":"\"\"","v":""}]
[{"$f":"\"\"","v":""}]
[{"$f":"\"\"","v":""}]
[{"$f":"\"\"","v":""}]
[{"$f":"\"\"","v":""}]
[{"$f":"\"\"","v":""}]
[{"$f":"\"\"","v":""}]
[{"$f":"\"\"","v":""}]
[{"$f":"\"\"","v":""}]
[{"$f":"\"\"","v":""}]
[{"$f":"\"\"","v":""}]
[{"$f":"\"\"","v":""}]
[{"$f":"\"\"","v":""}]
[{"$f":"\"\"","v":""}]
[{"$f":"\"\"","v":""}]
[{"$f":"\"\"","v":""}]
[{"$f":"\"\"","v":""}]
[{"$f":"\"\"","v":""}]
[{"$f":"\"\"","v":""}]
[{"$f":"\"\"","v":""}]
[{"$f":"\"\"","v":""}]
[{"$f":"\"\"","v":""}]
[{"$f":"\"\"","v":""}]
[{"$f":"\"\"","v":""}]
[{"$f":"\"\"","v":""}]
[{"$f":"\"\"","v":""}]
[{"$f":"\"\"","v":""}]
[{"$f":"\"\"","v":""}]
[{"$f":"\"\"","v":""}]
[{"$f":"\"\"","v":""}]
[{"$f":"\"\"","v":""}]
[{"$f":"\"\"","v":""}]
[{"$f":"\"\"","v":""}]
[{"$f":"\"\"","v":""}]
[{"$f":"\"\"","v":""}]
[{"$f":"\"\"","v":""}]
[{"$f":"\"\"","v":""}]
[{"$f":"\"\"","v":""}]
[{"$f":"\"\"","v":""}]
[{"$f":"\"\"","v":""}]
[{"$f":"\"\"","v":""}]
[{"$f":"\"\"","v":""}]
[{"$f":"\"\"","v":""}]
[{"$f":"\"\"","v":""}]
[{"$f":"\"\"","v":""}]
[{"$f":"\"\"","v":""}]
[{"$f":"\"\"","v":""}]
[{"$f":"\"\"","v":""}]
[{"$f":"\"\"","v":""}]
[{"$f":"\"\"","v":""}]
[{"$f":"\"\"","v":""}]
[{"$f":"\"\"","v":""}]
[{"$f":"\"\"","v":""}]
[{"$f":"\"\"","v":""}]
[{"$f":"\"\"","v":""}]
[{"$f":"\"\"","v":""}]
[{"$f":"\"\"","v":""}]
[{"$f":"\"\"","v":""}]
[{"$f":"\"\"","v":""}]
[{"$f":"\"\"","v":""}]
[{"$f":"\"\"","v":""}]
[{"$f":"\"\"","v":""}]
[{"$f":"\"\"","v":""}]
[{"$f":"\"\"","v":""}]
[{"$f":"\"\"","v":""}]
[{"$f":"\"\"","v":""}]
[{"$f":"\"\"","v":""}]
[{"$f":"\"\"","v":""}]
[{"$f":"\"\"","v":""}]
[{"$f":"\"\"","v":""}]
[{"$f":"\"\"","v":""}]
[{"$f":"\"\"","v":""}]
[{"$f":"\"\"","v":""}]
[{"$f":"\"\"","v":""}]
[{"$f":"\"\"","v":""}]
[{"$f":"\"\"","v":""}]
[{"$f":"\"\"","v":""}]
[{"$f":"\"\"","v":""}]
[{"$f":"\"\"","v":""}]
[{"$f":"\"\"","v":""}]
[{"$f":"\"\"","v":""}]
[{"$f":"\"\"","v":""}]
[{"$f":"\"\"","v":""}]
[{"$f":"\"\"","v":""}]
[{"$f":"\"\"","v":""}]
[{"$f":"\"\"","v":""}]
[{"$f":"\"\"","v":""}]
[{"$f":"\"\"","v":""}]
[{"$f":"\"\"","v":""}]
[{"$f":"\"\"","v":""}]
[{"$f":"\"\"","v":""}]
[{"$f":"\"\"","v":""}]
[{"$f":"\"\"","v":""}]
[{"$f":"\"\"","v":""}]
[{"$f":"\"\"","v":""}]
[{"$f":"\"\"","v":""}]
[{"$f":"\"\"","v":""}]
[{"$f":"\"\"","v":""}]
[{"$f":"\"\"","v":""}]
[{"$f":"\"\"","v":""}]
[{"$f":"\"\"","v":""}]
[{"$f":"\"\"","v":""}]
[{"$f":"\"\"","v":""}]
[{"$f":"\"\"","v":""}]
[{"$f":"\"\"","v":""}]
[{"$f":"\"\"","v":""}]
[{"$f":"\"\"","v":""}]
[{"$f":"\"\"","v":""}]
[{"$f":"\"\"","v":""}]
[{"$f":"\"\"","v":""}]
[{"$f":"\"\"","v":""}]
[{"$f":"\"\"","v":""}]
[{"$f":"\"\"","v":""}]
[{"$f":"\"\"","v":""}]
[{"$f":"\"\"","v":""}]
[{"$f":"\"\"","v":""}]
[{"$f":"\"\"","v":""}]
[{"$f":"\"\"","v":""}]
[{"$f":"\"\"","v":""}]
[{"$f":"\"\"","v":""}]
[{"$f":"\"\"","v":""}]
[{"$f":"\"\"","v":""}]
[{"$f":"\"\"","v":""}]
[{"$f":"\"\"","v":""}]
[{"$f":"\"\"","v":""}]
[{"$f":"\"\"","v":""}]
[{"$f":"\"\"","v":""}]
[{"$f":"\"\"","v":""}]
[{"$f":"\"\"","v":""}]
[{"$f":"\"\"","v":""}]
[{"$f":"\"\"","v":""}]
[{"$f":"\"\"","v":""}]
[{"$f":"\"\"","v":""}]
[{"$f":"\"\"","v":""}]
[{"$f":"\"\"","v":""}]
[{"$f":"\"\"","v":""}]
[{"$f":"\"\"","v":""}]
[{"$f":"\"\"","v":""}]
[{"$f":"\"\"","v":""}]
[{"$f":"\"\"","v":""}]

{"sheet":"Challenger","index":14,"n_rows":194,"n_cols":1,"rows_kept":194,"cut":false,"hidden":true,"merged":[]}
["MT555D - MT575D Auto VI (Classic Cab)"]
["MT555D - MT575D Auto VI (Deluxe)"]
["MT555D, MT565D, MT575D CVT (Deluxe)"]
["MT585D, MT595D Auto VI (Classic Cab)"]
["MT585D, MT595D Auto VI (Deluxe)"]
["MT585D CVT (Deluxe)"]
["MT645C, 655C, 665C, 675C CVT "]
["MT645D, 655D, 665D, 675D"]
["MT 315B, 325B, 335B and 345B"]
["MT 425B Dyna-4 "]
["MT 425B Speedshift"]
["MT 445B, 455B, 465B Dyna 4"]
["MT 445B, 455B, 465B Speedshift"]
["MT 525B Dyna Power VI"]
["MT 525B Dyna-VT"]
["MT 525B Dynashift"]
["MT 525B Tier3 Auto Power VI"]
["MT 525B Tier3 Tech Star CVT"]
["MT 535B & 545B Dyna Power VI"]
["MT 535B & 545B Dyna-VT"]
["MT 535B & 545B Dynashift"]
["MT 535B & 545B Tier3 Auto Power VI"]
["MT 535B & 545B Tier3 Tech Star CVT"]
["MT 555B & 565B Dyna-VT"]
["MT 555B & 565B Dynashift"]
["MT 555B, 565B, 575B Tier3 Auto Power VI"]
["MT 555B, 565B, 575B Tier3 Tech Star CVT"]
["MT 585B CVT, 595B CVT"]
["MT 635B, 645B, 655B, 665B"]
["MT425, 445, 455, 465"]
["MT565"]
[{"$f":"\"\"","v":""}]
[{"$f":"\"\"","v":""}]
[{"$f":"\"\"","v":""}]
[{"$f":"\"\"","v":""}]
[{"$f":"\"\"","v":""}]
[{"$f":"\"\"","v":""}]
[{"$f":"\"\"","v":""}]
[{"$f":"\"\"","v":""}]
[{"$f":"\"\"","v":""}]
[{"$f":"\"\"","v":""}]
[{"$f":"\"\"","v":""}]
[{"$f":"\"\"","v":""}]
[{"$f":"\"\"","v":""}]
[{"$f":"\"\"","v":""}]
[{"$f":"\"\"","v":""}]
[{"$f":"\"\"","v":""}]
[{"$f":"\"\"","v":""}]
[{"$f":"\"\"","v":""}]
[{"$f":"\"\"","v":""}]
[{"$f":"\"\"","v":""}]
[{"$f":"\"\"","v":""}]
[{"$f":"\"\"","v":""}]
[{"$f":"\"\"","v":""}]
[{"$f":"\"\"","v":""}]
[{"$f":"\"\"","v":""}]
[{"$f":"\"\"","v":""}]
[{"$f":"\"\"","v":""}]
[{"$f":"\"\"","v":""}]
[{"$f":"\"\"","v":""}]
[{"$f":"\"\"","v":""}]
[{"$f":"\"\"","v":""}]
[{"$f":"\"\"","v":""}]
[{"$f":"\"\"","v":""}]
[{"$f":"\"\"","v":""}]
[{"$f":"\"\"","v":""}]
[{"$f":"\"\"","v":""}]
[{"$f":"\"\"","v":""}]
[{"$f":"\"\"","v":""}]
[{"$f":"\"\"","v":""}]
[{"$f":"\"\"","v":""}]
[{"$f":"\"\"","v":""}]
[{"$f":"\"\"","v":""}]
[{"$f":"\"\"","v":""}]
[{"$f":"\"\"","v":""}]
[{"$f":"\"\"","v":""}]
[{"$f":"\"\"","v":""}]
[{"$f":"\"\"","v":""}]
[{"$f":"\"\"","v":""}]
[{"$f":"\"\"","v":""}]
[{"$f":"\"\"","v":""}]
[{"$f":"\"\"","v":""}]
[{"$f":"\"\"","v":""}]
[{"$f":"\"\"","v":""}]
[{"$f":"\"\"","v":""}]
[{"$f":"\"\"","v":""}]
[{"$f":"\"\"","v":""}]
[{"$f":"\"\"","v":""}]
[{"$f":"\"\"","v":""}]
[{"$f":"\"\"","v":""}]
[{"$f":"\"\"","v":""}]
[{"$f":"\"\"","v":""}]
[{"$f":"\"\"","v":""}]
[{"$f":"\"\"","v":""}]
[{"$f":"\"\"","v":""}]
[{"$f":"\"\"","v":""}]
[{"$f":"\"\"","v":""}]
[{"$f":"\"\"","v":""}]
[{"$f":"\"\"","v":""}]
[{"$f":"\"\"","v":""}]
[{"$f":"\"\"","v":""}]
[{"$f":"\"\"","v":""}]
[{"$f":"\"\"","v":""}]
[{"$f":"\"\"","v":""}]
[{"$f":"\"\"","v":""}]
[{"$f":"\"\"","v":""}]
[{"$f":"\"\"","v":""}]
[{"$f":"\"\"","v":""}]
[{"$f":"\"\"","v":""}]
[{"$f":"\"\"","v":""}]
[{"$f":"\"\"","v":""}]
[{"$f":"\"\"","v":""}]
[{"$f":"\"\"","v":""}]
[{"$f":"\"\"","v":""}]
[{"$f":"\"\"","v":""}]
[{"$f":"\"\"","v":""}]
[{"$f":"\"\"","v":""}]
[{"$f":"\"\"","v":""}]
[{"$f":"\"\"","v":""}]
[{"$f":"\"\"","v":""}]
[{"$f":"\"\"","v":""}]
[{"$f":"\"\"","v":""}]
[{"$f":"\"\"","v":""}]
[{"$f":"\"\"","v":""}]
[{"$f":"\"\"","v":""}]
[{"$f":"\"\"","v":""}]
[{"$f":"\"\"","v":""}]
[{"$f":"\"\"","v":""}]
[{"$f":"\"\"","v":""}]
[{"$f":"\"\"","v":""}]
[{"$f":"\"\"","v":""}]
[{"$f":"\"\"","v":""}]
[{"$f":"\"\"","v":""}]
[{"$f":"\"\"","v":""}]
[{"$f":"\"\"","v":""}]
[{"$f":"\"\"","v":""}]
[{"$f":"\"\"","v":""}]
[{"$f":"\"\"","v":""}]
[{"$f":"\"\"","v":""}]
[{"$f":"\"\"","v":""}]
[{"$f":"\"\"","v":""}]
[{"$f":"\"\"","v":""}]
[{"$f":"\"\"","v":""}]
[{"$f":"\"\"","v":""}]
[{"$f":"\"\"","v":""}]
[{"$f":"\"\"","v":""}]
[{"$f":"\"\"","v":""}]
[{"$f":"\"\"","v":""}]
[{"$f":"\"\"","v":""}]
[{"$f":"\"\"","v":""}]
[{"$f":"\"\"","v":""}]
[{"$f":"\"\"","v":""}]
[{"$f":"\"\"","v":""}]
[{"$f":"\"\"","v":""}]
[{"$f":"\"\"","v":""}]
[{"$f":"\"\"","v":""}]
[{"$f":"\"\"","v":""}]
[{"$f":"\"\"","v":""}]
[{"$f":"\"\"","v":""}]
[{"$f":"\"\"","v":""}]
[{"$f":"\"\"","v":""}]
[{"$f":"\"\"","v":""}]
[{"$f":"\"\"","v":""}]
[{"$f":"\"\"","v":""}]
[{"$f":"\"\"","v":""}]
[{"$f":"\"\"","v":""}]
[{"$f":"\"\"","v":""}]
[{"$f":"\"\"","v":""}]
[{"$f":"\"\"","v":""}]
[{"$f":"\"\"","v":""}]
[{"$f":"\"\"","v":""}]
[{"$f":"\"\"","v":""}]
[{"$f":"\"\"","v":""}]
[{"$f":"\"\"","v":""}]
[{"$f":"\"\"","v":""}]
[{"$f":"\"\"","v":""}]
[{"$f":"\"\"","v":""}]
[{"$f":"\"\"","v":""}]
[{"$f":"\"\"","v":""}]
[{"$f":"\"\"","v":""}]
[{"$f":"\"\"","v":""}]
[{"$f":"\"\"","v":""}]
[{"$f":"\"\"","v":""}]
[{"$f":"\"\"","v":""}]
[{"$f":"\"\"","v":""}]
[{"$f":"\"\"","v":""}]
[{"$f":"\"\"","v":""}]
[{"$f":"\"\"","v":""}]
[{"$f":"\"\"","v":""}]
[{"$f":"\"\"","v":""}]
[{"$f":"\"\"","v":""}]
[{"$f":"\"\"","v":""}]
[{"$f":"\"\"","v":""}]
[{"$f":"\"\"","v":""}]

{"sheet":"Deutz","index":15,"n_rows":191,"n_cols":1,"rows_kept":191,"cut":false,"hidden":true,"merged":[]}
["Agrolux 45-75"]
["Agroplus 310,315,320 + Ecoline"]
["Agrolplus 410,420 + Ecoline"]
["Agrofarm 85, 100, 410, 420 and 430"]
["Agrofarm TTV420 and TTV430 + Profiline"]
["Agrofarm 410T and 420T"]
["Agrofarm 410TB and 420TB"]
["Agrotron K90-120, K410,420 and 430"]
["Agrotron K90-120, K410,420, 430 (Profiline)"]
["Agrotron K-110 and K-610"]
["Agrotron K-110 & K-610 (Profiline)"]
["Agrotron M410 and M420"]
["Agrotron TTV 410, 420, 430 + Profiline"]
["Agrotron M600 - M625 + Profiline"]
["Agrotron M640"]
["Agrotron M640 Profiline"]
["Agrotron TTV 610 and TTV 620"]
["Agrotron M650"]
["Agrotron M650 Profiline"]
["Agrotron TTV 630, TTV7210, 7230, 7250"]
["5100 , 5110, 5120, 5130"]
["5100 , 5110, 5120, 5130 Profiline and TTV"]
["Agrotron 6150, 6160 "]
["Agrotron 6150, 6160 Profiline and TTV"]
["Agrotron 6150.4, 6160.4"]
["Agrotron 6150.4, 6160.4 Profiline and TTV"]
["Agrotron 6180, 6190"]
["Agrotron 6180, 6190  Profiline and TTV"]
[{"$f":"\"\"","v":""}]
[{"$f":"\"\"","v":""}]
[{"$f":"\"\"","v":""}]
[{"$f":"\"\"","v":""}]
[{"$f":"\"\"","v":""}]
[{"$f":"\"\"","v":""}]
[{"$f":"\"\"","v":""}]
[{"$f":"\"\"","v":""}]
[{"$f":"\"\"","v":""}]
[{"$f":"\"\"","v":""}]
[{"$f":"\"\"","v":""}]
[{"$f":"\"\"","v":""}]
[{"$f":"\"\"","v":""}]
[{"$f":"\"\"","v":""}]
[{"$f":"\"\"","v":""}]
[{"$f":"\"\"","v":""}]
[{"$f":"\"\"","v":""}]
[{"$f":"\"\"","v":""}]
[{"$f":"\"\"","v":""}]
[{"$f":"\"\"","v":""}]
[{"$f":"\"\"","v":""}]
[{"$f":"\"\"","v":""}]
[{"$f":"\"\"","v":""}]
[{"$f":"\"\"","v":""}]
[{"$f":"\"\"","v":""}]
[{"$f":"\"\"","v":""}]
[{"$f":"\"\"","v":""}]
[{"$f":"\"\"","v":""}]
[{"$f":"\"\"","v":""}]
[{"$f":"\"\"","v":""}]
[{"$f":"\"\"","v":""}]
[{"$f":"\"\"","v":""}]
[{"$f":"\"\"","v":""}]
[{"$f":"\"\"","v":""}]
[{"$f":"\"\"","v":""}]
[{"$f":"\"\"","v":""}]
[{"$f":"\"\"","v":""}]
[{"$f":"\"\"","v":""}]
[{"$f":"\"\"","v":""}]
[{"$f":"\"\"","v":""}]
[{"$f":"\"\"","v":""}]
[{"$f":"\"\"","v":""}]
[{"$f":"\"\"","v":""}]
[{"$f":"\"\"","v":""}]
[{"$f":"\"\"","v":""}]
[{"$f":"\"\"","v":""}]
[{"$f":"\"\"","v":""}]
[{"$f":"\"\"","v":""}]
[{"$f":"\"\"","v":""}]
[{"$f":"\"\"","v":""}]
[{"$f":"\"\"","v":""}]
[{"$f":"\"\"","v":""}]
[{"$f":"\"\"","v":""}]
[{"$f":"\"\"","v":""}]
[{"$f":"\"\"","v":""}]
[{"$f":"\"\"","v":""}]
[{"$f":"\"\"","v":""}]
[{"$f":"\"\"","v":""}]
[{"$f":"\"\"","v":""}]
[{"$f":"\"\"","v":""}]
[{"$f":"\"\"","v":""}]
[{"$f":"\"\"","v":""}]
[{"$f":"\"\"","v":""}]
[{"$f":"\"\"","v":""}]
[{"$f":"\"\"","v":""}]
[{"$f":"\"\"","v":""}]
[{"$f":"\"\"","v":""}]
[{"$f":"\"\"","v":""}]
[{"$f":"\"\"","v":""}]
[{"$f":"\"\"","v":""}]
[{"$f":"\"\"","v":""}]
[{"$f":"\"\"","v":""}]
[{"$f":"\"\"","v":""}]
[{"$f":"\"\"","v":""}]
[{"$f":"\"\"","v":""}]
[{"$f":"\"\"","v":""}]
[{"$f":"\"\"","v":""}]
[{"$f":"\"\"","v":""}]
[{"$f":"\"\"","v":""}]
[{"$f":"\"\"","v":""}]
[{"$f":"\"\"","v":""}]
[{"$f":"\"\"","v":""}]
[{"$f":"\"\"","v":""}]
[{"$f":"\"\"","v":""}]
[{"$f":"\"\"","v":""}]
[{"$f":"\"\"","v":""}]
[{"$f":"\"\"","v":""}]
[{"$f":"\"\"","v":""}]
[{"$f":"\"\"","v":""}]
[{"$f":"\"\"","v":""}]
[{"$f":"\"\"","v":""}]
[{"$f":"\"\"","v":""}]
[{"$f":"\"\"","v":""}]
[{"$f":"\"\"","v":""}]
[{"$f":"\"\"","v":""}]
[{"$f":"\"\"","v":""}]
[{"$f":"\"\"","v":""}]
[{"$f":"\"\"","v":""}]
[{"$f":"\"\"","v":""}]
[{"$f":"\"\"","v":""}]
[{"$f":"\"\"","v":""}]
[{"$f":"\"\"","v":""}]
[{"$f":"\"\"","v":""}]
[{"$f":"\"\"","v":""}]
[{"$f":"\"\"","v":""}]
[{"$f":"\"\"","v":""}]
[{"$f":"\"\"","v":""}]
[{"$f":"\"\"","v":""}]
[{"$f":"\"\"","v":""}]
[{"$f":"\"\"","v":""}]
[{"$f":"\"\"","v":""}]
[{"$f":"\"\"","v":""}]
[{"$f":"\"\"","v":""}]
[{"$f":"\"\"","v":""}]
[{"$f":"\"\"","v":""}]
[{"$f":"\"\"","v":""}]
[{"$f":"\"\"","v":""}]
[{"$f":"\"\"","v":""}]
[{"$f":"\"\"","v":""}]
[{"$f":"\"\"","v":""}]
[{"$f":"\"\"","v":""}]
[{"$f":"\"\"","v":""}]
[{"$f":"\"\"","v":""}]
[{"$f":"\"\"","v":""}]
[{"$f":"\"\"","v":""}]
[{"$f":"\"\"","v":""}]
[{"$f":"\"\"","v":""}]
[{"$f":"\"\"","v":""}]
[{"$f":"\"\"","v":""}]
[{"$f":"\"\"","v":""}]
[{"$f":"\"\"","v":""}]
[{"$f":"\"\"","v":""}]
[{"$f":"\"\"","v":""}]
[{"$f":"\"\"","v":""}]
[{"$f":"\"\"","v":""}]
[{"$f":"\"\"","v":""}]
[{"$f":"\"\"","v":""}]
[{"$f":"\"\"","v":""}]
[{"$f":"\"\"","v":""}]
[{"$f":"\"\"","v":""}]
[{"$f":"\"\"","v":""}]
[{"$f":"\"\"","v":""}]
[{"$f":"\"\"","v":""}]
[{"$f":"\"\"","v":""}]
[{"$f":"\"\"","v":""}]
[{"$f":"\"\"","v":""}]
[{"$f":"\"\"","v":""}]
[{"$f":"\"\"","v":""}]
[{"$f":"\"\"","v":""}]
[{"$f":"\"\"","v":""}]
[{"$f":"\"\"","v":""}]
[{"$f":"\"\"","v":""}]
[{"$f":"\"\"","v":""}]
[{"$f":"\"\"","v":""}]
[{"$f":"\"\"","v":""}]
[{"$f":"\"\"","v":""}]
[{"$f":"\"\"","v":""}]
[{"$f":"\"\"","v":""}]
[{"$f":"\"\"","v":""}]
[{"$f":"\"\"","v":""}]
[{"$f":"\"\"","v":""}]
[{"$f":"\"\"","v":""}]
[{"$f":"\"\"","v":""}]

{"sheet":"John Deere","index":16,"n_rows":220,"n_cols":1,"rows_kept":220,"cut":false,"hidden":true,"merged":[]}
["5045E, 5055E, 5065E, 5075E (Teir 3)"]
["5045E, 5055E, 5065E, 5075E (Teir 4)"]
["5085E, 5100E (Teir 3)"]
["5085E, 5100E  (Teir4)"]
["5083E, 5093E, 5101E, 5425, 5525, 5625, 5603"]
["5065M, 5075M, 5085M (Teir 3&4)"]
["5095M, 5105M, 5100M, 5115M (Teir 3&4)"]
["6100D, 6115D, 6130D, 6140D"]
["61105D, 6115D, 6130D, 60140D T4"]
["6105E, 6120E, 6135E T4F"]
["6105M, 6115M, 6125M"]
["6105R, 6110R, 6115R,6120R, 6125R"]
["6130M, 6140M, 6150M"]
["6135M, 6145M, 6155M"]
["6130R, 6140R, 6150R"]
["6135R, 6145R"]
["6170M, 6190M, 6210M"]
["6175M, 6195M, 6215M"]
["6170R, 6190R, 6210R"]
["6175R, 6195R, 6215R"]
["7200R, 7210R, 7215R, 7230R "]
["7250R, 7260R, 7270R, 7280R, 7290R"]
["8245R, 8270R, 8295R, 8320R, 8335R, 8345R "]
["5105, 5205"]
["5103, 5203, 5303, 5403"]
["5225, 5325"]
["6403'"]
["6603'"]
["6000, 6100, 6200, 6300, 6400, 6405"]
["6010, 6110, 6210, 6310, 6410"]
["6215, 6415, 6120, 6220, 6320, 6420"]
["7200, 7300, 7400"]
["7210, 7310, 7410, 7510, 6605, 7405"]
["7600, 7700, 7800, 7610, 7710, 7810"]
["6615, 6715, 7220, 7320, 7420, 7520"]
["6120L , 6220L, 6320L, 6420L, 6520L"]
["6230L, 6330L, 6430L"]
["6230, 6330, 6430"]
["7130, 7230, 7330"]
["7430, 7530"]
["7720, 7820, 7920, 7630, 7730, 7830, 7930"]
["8100 - 8400, 8110 - 8410"]
["2350, 2355 - 2750, 2755"]
["5220, 5320"]
["5420, 5520"]
["5200-5310, 5400"]
["5410, 5500, 5510"]
["5300N, 5310N, 5400N Narrow"]
["5410N, 5500N, 5510N Narrow"]
["5320N Narrow"]
["5420N, 5520N"]
["2150, 2155"]
["2950, 2955 - 3255"]
["4020'"]
["4420, 4230, 4430, 4240, 4440"]
["4050/4055 -  4450/4455"]
[{"$f":"\"\"","v":""}]
["5045D,5055D"]
[{"$f":"\"\"","v":""}]
[{"$f":"\"\"","v":""}]
[{"$f":"\"\"","v":""}]
[{"$f":"\"\"","v":""}]
[{"$f":"\"\"","v":""}]
[{"$f":"\"\"","v":""}]
[{"$f":"\"\"","v":""}]
[{"$f":"\"\"","v":""}]
[{"$f":"\"\"","v":""}]
[{"$f":"\"\"","v":""}]
[{"$f":"\"\"","v":""}]
[{"$f":"\"\"","v":""}]
[{"$f":"\"\"","v":""}]
[{"$f":"\"\"","v":""}]
[{"$f":"\"\"","v":""}]
[{"$f":"\"\"","v":""}]
[{"$f":"\"\"","v":""}]
[{"$f":"\"\"","v":""}]
[{"$f":"\"\"","v":""}]
[{"$f":"\"\"","v":""}]
[{"$f":"\"\"","v":""}]
[{"$f":"\"\"","v":""}]
[{"$f":"\"\"","v":""}]
[{"$f":"\"\"","v":""}]
[{"$f":"\"\"","v":""}]
[{"$f":"\"\"","v":""}]
[{"$f":"\"\"","v":""}]
[{"$f":"\"\"","v":""}]
[{"$f":"\"\"","v":""}]
[{"$f":"\"\"","v":""}]
[{"$f":"\"\"","v":""}]
[{"$f":"\"\"","v":""}]
[{"$f":"\"\"","v":""}]
[{"$f":"\"\"","v":""}]
[{"$f":"\"\"","v":""}]
[{"$f":"\"\"","v":""}]
[{"$f":"\"\"","v":""}]
[{"$f":"\"\"","v":""}]
[{"$f":"\"\"","v":""}]
[{"$f":"\"\"","v":""}]
[{"$f":"\"\"","v":""}]
[{"$f":"\"\"","v":""}]
[{"$f":"\"\"","v":""}]
[{"$f":"\"\"","v":""}]
[{"$f":"\"\"","v":""}]
[{"$f":"\"\"","v":""}]
[{"$f":"\"\"","v":""}]
[{"$f":"\"\"","v":""}]
[{"$f":"\"\"","v":""}]
[{"$f":"\"\"","v":""}]
[{"$f":"\"\"","v":""}]
[{"$f":"\"\"","v":""}]
[{"$f":"\"\"","v":""}]
[{"$f":"\"\"","v":""}]
[{"$f":"\"\"","v":""}]
[{"$f":"\"\"","v":""}]
[{"$f":"\"\"","v":""}]
[{"$f":"\"\"","v":""}]
[{"$f":"\"\"","v":""}]
[{"$f":"\"\"","v":""}]
[{"$f":"\"\"","v":""}]
[{"$f":"\"\"","v":""}]
[{"$f":"\"\"","v":""}]
[{"$f":"\"\"","v":""}]
[{"$f":"\"\"","v":""}]
[{"$f":"\"\"","v":""}]
[{"$f":"\"\"","v":""}]
[{"$f":"\"\"","v":""}]
[{"$f":"\"\"","v":""}]
[{"$f":"\"\"","v":""}]
[{"$f":"\"\"","v":""}]
[{"$f":"\"\"","v":""}]
[{"$f":"\"\"","v":""}]
[{"$f":"\"\"","v":""}]
[{"$f":"\"\"","v":""}]
[{"$f":"\"\"","v":""}]
[{"$f":"\"\"","v":""}]
[{"$f":"\"\"","v":""}]
[{"$f":"\"\"","v":""}]
[{"$f":"\"\"","v":""}]
[{"$f":"\"\"","v":""}]
[{"$f":"\"\"","v":""}]
[{"$f":"\"\"","v":""}]
[{"$f":"\"\"","v":""}]
[{"$f":"\"\"","v":""}]
[{"$f":"\"\"","v":""}]
[{"$f":"\"\"","v":""}]
[{"$f":"\"\"","v":""}]
[{"$f":"\"\"","v":""}]
[{"$f":"\"\"","v":""}]
[{"$f":"\"\"","v":""}]
[{"$f":"\"\"","v":""}]
[{"$f":"\"\"","v":""}]
[{"$f":"\"\"","v":""}]
[{"$f":"\"\"","v":""}]
[{"$f":"\"\"","v":""}]
[{"$f":"\"\"","v":""}]
[{"$f":"\"\"","v":""}]
[{"$f":"\"\"","v":""}]
[{"$f":"\"\"","v":""}]
[{"$f":"\"\"","v":""}]
[{"$f":"\"\"","v":""}]
[{"$f":"\"\"","v":""}]
[{"$f":"\"\"","v":""}]
[{"$f":"\"\"","v":""}]
[{"$f":"\"\"","v":""}]
[{"$f":"\"\"","v":""}]
[{"$f":"\"\"","v":""}]
[{"$f":"\"\"","v":""}]
[{"$f":"\"\"","v":""}]
[{"$f":"\"\"","v":""}]
[{"$f":"\"\"","v":""}]
[{"$f":"\"\"","v":""}]
[{"$f":"\"\"","v":""}]
[{"$f":"\"\"","v":""}]
[{"$f":"\"\"","v":""}]
[{"$f":"\"\"","v":""}]
[{"$f":"\"\"","v":""}]
[{"$f":"\"\"","v":""}]
[{"$f":"\"\"","v":""}]
[{"$f":"\"\"","v":""}]
[{"$f":"\"\"","v":""}]
[{"$f":"\"\"","v":""}]
[{"$f":"\"\"","v":""}]
[{"$f":"\"\"","v":""}]
[{"$f":"\"\"","v":""}]
[{"$f":"\"\"","v":""}]
[{"$f":"\"\"","v":""}]
[{"$f":"\"\"","v":""}]
[{"$f":"\"\"","v":""}]
[{"$f":"\"\"","v":""}]
[{"$f":"\"\"","v":""}]
[{"$f":"\"\"","v":""}]
[{"$f":"\"\"","v":""}]
[{"$f":"\"\"","v":""}]
[{"$f":"\"\"","v":""}]
[{"$f":"\"\"","v":""}]
[{"$f":"\"\"","v":""}]
[{"$f":"\"\"","v":""}]
[{"$f":"\"\"","v":""}]
[{"$f":"\"\"","v":""}]
[{"$f":"\"\"","v":""}]
[{"$f":"\"\"","v":""}]
[{"$f":"\"\"","v":""}]
[{"$f":"\"\"","v":""}]
[{"$f":"\"\"","v":""}]
[{"$f":"\"\"","v":""}]
[{"$f":"\"\"","v":""}]
[{"$f":"\"\"","v":""}]
[{"$f":"\"\"","v":""}]
[{"$f":"\"\"","v":""}]
[{"$f":"\"\"","v":""}]
[{"$f":"\"\"","v":""}]
[{"$f":"\"\"","v":""}]
[{"$f":"\"\"","v":""}]
[{"$f":"\"\"","v":""}]
[{"$f":"\"\"","v":""}]
[{"$f":"\"\"","v":""}]
[{"$f":"\"\"","v":""}]
[{"$f":"\"\"","v":""}]
[{"$f":"\"\"","v":""}]
[{"$f":"\"\"","v":""}]

{"sheet":"Kubota","index":17,"n_rows":183,"n_cols":1,"rows_kept":183,"cut":false,"hidden":true,"merged":[]}
["M5040-M7040, M5060-7060"]
["M5-091, 101"]
["M6-101, 111"]
["M6-131, 141"]
["M6S-111"]
["M7-131, 151, 171"]
["M8540, 9540"]
["M8560, M9960 TIER 4I"]
["M95S, M105S"]
["M96S, M108S"]
["M95X, M105X, M108X"]
["M100X, M110X"]
["M110, M120"]
["M125X"]
["M126X, M135X"]
["M100GXDTCC, M110GXDTCC"]
["M126GXDTCC, M135GXDTCC"]
["M47/49/54/57/6800 ROPS"]
["M47/49/54/57/6800 CAB"]
["M8200, M9000 ROPS"]
["M8200, M9000 CAB"]
["M8200 Narrow SDNBC"]
["M100 DTC"]
[{"$f":"\"\"","v":""}]
["B3200, B3300 "]
["L2800, L3400,L3200,L3800,3301,L3901 "]
["L3240 2/4WD, L3540, L3940 "]
["L5240, L5740"]
["MX4700, MX5100 "]
[{"$f":"\"\"","v":""}]
[{"$f":"\"\"","v":""}]
[{"$f":"\"\"","v":""}]
[{"$f":"\"\"","v":""}]
[{"$f":"\"\"","v":""}]
[{"$f":"\"\"","v":""}]
[{"$f":"\"\"","v":""}]
[{"$f":"\"\"","v":""}]
[{"$f":"\"\"","v":""}]
[{"$f":"\"\"","v":""}]
[{"$f":"\"\"","v":""}]
[{"$f":"\"\"","v":""}]
[{"$f":"\"\"","v":""}]
[{"$f":"\"\"","v":""}]
[{"$f":"\"\"","v":""}]
[{"$f":"\"\"","v":""}]
[{"$f":"\"\"","v":""}]
[{"$f":"\"\"","v":""}]
[{"$f":"\"\"","v":""}]
[{"$f":"\"\"","v":""}]
[{"$f":"\"\"","v":""}]
[{"$f":"\"\"","v":""}]
[{"$f":"\"\"","v":""}]
[{"$f":"\"\"","v":""}]
[{"$f":"\"\"","v":""}]
[{"$f":"\"\"","v":""}]
[{"$f":"\"\"","v":""}]
[{"$f":"\"\"","v":""}]
[{"$f":"\"\"","v":""}]
[{"$f":"\"\"","v":""}]
[{"$f":"\"\"","v":""}]
[{"$f":"\"\"","v":""}]
[{"$f":"\"\"","v":""}]
[{"$f":"\"\"","v":""}]
[{"$f":"\"\"","v":""}]
[{"$f":"\"\"","v":""}]
[{"$f":"\"\"","v":""}]
[{"$f":"\"\"","v":""}]
[{"$f":"\"\"","v":""}]
[{"$f":"\"\"","v":""}]
[{"$f":"\"\"","v":""}]
[{"$f":"\"\"","v":""}]
[{"$f":"\"\"","v":""}]
[{"$f":"\"\"","v":""}]
[{"$f":"\"\"","v":""}]
[{"$f":"\"\"","v":""}]
[{"$f":"\"\"","v":""}]
[{"$f":"\"\"","v":""}]
[{"$f":"\"\"","v":""}]
[{"$f":"\"\"","v":""}]
[{"$f":"\"\"","v":""}]
[{"$f":"\"\"","v":""}]
[{"$f":"\"\"","v":""}]
[{"$f":"\"\"","v":""}]
[{"$f":"\"\"","v":""}]
[{"$f":"\"\"","v":""}]
[{"$f":"\"\"","v":""}]
[{"$f":"\"\"","v":""}]
[{"$f":"\"\"","v":""}]
[{"$f":"\"\"","v":""}]
[{"$f":"\"\"","v":""}]
[{"$f":"\"\"","v":""}]
[{"$f":"\"\"","v":""}]
[{"$f":"\"\"","v":""}]
[{"$f":"\"\"","v":""}]
[{"$f":"\"\"","v":""}]
[{"$f":"\"\"","v":""}]
[{"$f":"\"\"","v":""}]
[{"$f":"\"\"","v":""}]
[{"$f":"\"\"","v":""}]
[{"$f":"\"\"","v":""}]
[{"$f":"\"\"","v":""}]
[{"$f":"\"\"","v":""}]
[{"$f":"\"\"","v":""}]
[{"$f":"\"\"","v":""}]
[{"$f":"\"\"","v":""}]
[{"$f":"\"\"","v":""}]
[{"$f":"\"\"","v":""}]
[{"$f":"\"\"","v":""}]
[{"$f":"\"\"","v":""}]
[{"$f":"\"\"","v":""}]
[{"$f":"\"\"","v":""}]
[{"$f":"\"\"","v":""}]
[{"$f":"\"\"","v":""}]
[{"$f":"\"\"","v":""}]
[{"$f":"\"\"","v":""}]
[{"$f":"\"\"","v":""}]
[{"$f":"\"\"","v":""}]
[{"$f":"\"\"","v":""}]
[{"$f":"\"\"","v":""}]
[{"$f":"\"\"","v":""}]
[{"$f":"\"\"","v":""}]
[{"$f":"\"\"","v":""}]
[{"$f":"\"\"","v":""}]
[{"$f":"\"\"","v":""}]
[{"$f":"\"\"","v":""}]
[{"$f":"\"\"","v":""}]
[{"$f":"\"\"","v":""}]
[{"$f":"\"\"","v":""}]
[{"$f":"\"\"","v":""}]
[{"$f":"\"\"","v":""}]
[{"$f":"\"\"","v":""}]
[{"$f":"\"\"","v":""}]
[{"$f":"\"\"","v":""}]
[{"$f":"\"\"","v":""}]
[{"$f":"\"\"","v":""}]
[{"$f":"\"\"","v":""}]
[{"$f":"\"\"","v":""}]
[{"$f":"\"\"","v":""}]
[{"$f":"\"\"","v":""}]
[{"$f":"\"\"","v":""}]
[{"$f":"\"\"","v":""}]
[{"$f":"\"\"","v":""}]
[{"$f":"\"\"","v":""}]
[{"$f":"\"\"","v":""}]
[{"$f":"\"\"","v":""}]
[{"$f":"\"\"","v":""}]
[{"$f":"\"\"","v":""}]
[{"$f":"\"\"","v":""}]
[{"$f":"\"\"","v":""}]
[{"$f":"\"\"","v":""}]
[{"$f":"\"\"","v":""}]
[{"$f":"\"\"","v":""}]
[{"$f":"\"\"","v":""}]
[{"$f":"\"\"","v":""}]
[{"$f":"\"\"","v":""}]
[{"$f":"\"\"","v":""}]
[{"$f":"\"\"","v":""}]
[{"$f":"\"\"","v":""}]
[{"$f":"\"\"","v":""}]
[{"$f":"\"\"","v":""}]
[{"$f":"\"\"","v":""}]
[{"$f":"\"\"","v":""}]
[{"$f":"\"\"","v":""}]
[{"$f":"\"\"","v":""}]
[{"$f":"\"\"","v":""}]
[{"$f":"\"\"","v":""}]
[{"$f":"\"\"","v":""}]
[{"$f":"\"\"","v":""}]
[{"$f":"\"\"","v":""}]
[{"$f":"\"\"","v":""}]
[{"$f":"\"\"","v":""}]
[{"$f":"\"\"","v":""}]
[{"$f":"\"\"","v":""}]
[{"$f":"\"\"","v":""}]
[{"$f":"\"\"","v":""}]
[{"$f":"\"\"","v":""}]
[{"$f":"\"\"","v":""}]
[{"$f":"\"\"","v":""}]
[{"$f":"\"\"","v":""}]
[{"$f":"\"\"","v":""}]
[{"$f":"\"\"","v":""}]
[{"$f":"\"\"","v":""}]
[{"$f":"\"\"","v":""}]

{"sheet":"Landini","index":18,"n_rows":191,"n_cols":1,"rows_kept":191,"cut":false,"hidden":true,"merged":[]}
["Alpine 70,80,85 Tier 3 STD /  GT"]
["Powerfarm 60 TIER 2"]
["Powerfarm 75-105 TIER 2 & 90-110 TIER 3"]
["5-090H, 5-100H, 5-110H"]
["Vision 80, 85, 90 TIER 2"]
["Vision 95 - 105 TIER 2 & 3"]
["Powermondial 100, 105, 115"]
["Landpower 125, 135 TIER 2"]
["Landpower 145 TIER 2"]
["Landpower 165, 185 TIER 2"]
["Landpower 125, 135 TIER 3"]
["Landpower 145 TIER 3"]
["Landpower 165, 185 TIER 3"]
["Rex 75, 85, 95, 105 F/GE Tier 2"]
["Rex 80, 90, 100, 110 F/GE Tier 3"]
["5865 ROPS"]
["6865, 8865"]
["Mythos 90, 100, 105"]
["Mythos 115"]
["Legend 115-135 NG"]
["Legend 140 - 185 NG"]
["6860 Evolution, 65 Blizzard"]
["8860 Evolution, 85 Blizzard"]
["Ghibli 80, 90, 100"]
["6880, 7880, 8880, 9880"]
["Rex 70, 80, 90, 100 F, L, GT (Not Tier 3)"]
["Advantage 65, 75, 85 F & S"]
["Advantage 65, 75, 85 F & S"]
[{"$f":"\"\"","v":""}]
["1-25H"]
["1-40M/HC , 1-50M/HC"]
["1-55M/C"]
[{"$f":"\"\"","v":""}]
[{"$f":"\"\"","v":""}]
[{"$f":"\"\"","v":""}]
[{"$f":"\"\"","v":""}]
[{"$f":"\"\"","v":""}]
[{"$f":"\"\"","v":""}]
[{"$f":"\"\"","v":""}]
[{"$f":"\"\"","v":""}]
[{"$f":"\"\"","v":""}]
[{"$f":"\"\"","v":""}]
[{"$f":"\"\"","v":""}]
[{"$f":"\"\"","v":""}]
[{"$f":"\"\"","v":""}]
[{"$f":"\"\"","v":""}]
[{"$f":"\"\"","v":""}]
[{"$f":"\"\"","v":""}]
[{"$f":"\"\"","v":""}]
[{"$f":"\"\"","v":""}]
[{"$f":"\"\"","v":""}]
[{"$f":"\"\"","v":""}]
[{"$f":"\"\"","v":""}]
[{"$f":"\"\"","v":""}]
[{"$f":"\"\"","v":""}]
[{"$f":"\"\"","v":""}]
[{"$f":"\"\"","v":""}]
[{"$f":"\"\"","v":""}]
[{"$f":"\"\"","v":""}]
[{"$f":"\"\"","v":""}]
[{"$f":"\"\"","v":""}]
[{"$f":"\"\"","v":""}]
[{"$f":"\"\"","v":""}]
[{"$f":"\"\"","v":""}]
[{"$f":"\"\"","v":""}]
[{"$f":"\"\"","v":""}]
[{"$f":"\"\"","v":""}]
[{"$f":"\"\"","v":""}]
[{"$f":"\"\"","v":""}]
[{"$f":"\"\"","v":""}]
[{"$f":"\"\"","v":""}]
[{"$f":"\"\"","v":""}]
[{"$f":"\"\"","v":""}]
[{"$f":"\"\"","v":""}]
[{"$f":"\"\"","v":""}]
[{"$f":"\"\"","v":""}]
[{"$f":"\"\"","v":""}]
[{"$f":"\"\"","v":""}]
[{"$f":"\"\"","v":""}]
[{"$f":"\"\"","v":""}]
[{"$f":"\"\"","v":""}]
[{"$f":"\"\"","v":""}]
[{"$f":"\"\"","v":""}]
[{"$f":"\"\"","v":""}]
[{"$f":"\"\"","v":""}]
[{"$f":"\"\"","v":""}]
[{"$f":"\"\"","v":""}]
[{"$f":"\"\"","v":""}]
[{"$f":"\"\"","v":""}]
[{"$f":"\"\"","v":""}]
[{"$f":"\"\"","v":""}]
[{"$f":"\"\"","v":""}]
[{"$f":"\"\"","v":""}]
[{"$f":"\"\"","v":""}]
[{"$f":"\"\"","v":""}]
[{"$f":"\"\"","v":""}]
[{"$f":"\"\"","v":""}]
[{"$f":"\"\"","v":""}]
[{"$f":"\"\"","v":""}]
[{"$f":"\"\"","v":""}]
[{"$f":"\"\"","v":""}]
[{"$f":"\"\"","v":""}]
[{"$f":"\"\"","v":""}]
[{"$f":"\"\"","v":""}]
[{"$f":"\"\"","v":""}]
[{"$f":"\"\"","v":""}]
[{"$f":"\"\"","v":""}]
[{"$f":"\"\"","v":""}]
[{"$f":"\"\"","v":""}]
[{"$f":"\"\"","v":""}]
[{"$f":"\"\"","v":""}]
[{"$f":"\"\"","v":""}]
[{"$f":"\"\"","v":""}]
[{"$f":"\"\"","v":""}]
[{"$f":"\"\"","v":""}]
[{"$f":"\"\"","v":""}]
[{"$f":"\"\"","v":""}]
[{"$f":"\"\"","v":""}]
[{"$f":"\"\"","v":""}]
[{"$f":"\"\"","v":""}]
[{"$f":"\"\"","v":""}]
[{"$f":"\"\"","v":""}]
[{"$f":"\"\"","v":""}]
[{"$f":"\"\"","v":""}]
[{"$f":"\"\"","v":""}]
[{"$f":"\"\"","v":""}]
[{"$f":"\"\"","v":""}]
[{"$f":"\"\"","v":""}]
[{"$f":"\"\"","v":""}]
[{"$f":"\"\"","v":""}]
[{"$f":"\"\"","v":""}]
[{"$f":"\"\"","v":""}]
[{"$f":"\"\"","v":""}]
[{"$f":"\"\"","v":""}]
[{"$f":"\"\"","v":""}]
[{"$f":"\"\"","v":""}]
[{"$f":"\"\"","v":""}]
[{"$f":"\"\"","v":""}]
[{"$f":"\"\"","v":""}]
[{"$f":"\"\"","v":""}]
[{"$f":"\"\"","v":""}]
[{"$f":"\"\"","v":""}]
[{"$f":"\"\"","v":""}]
[{"$f":"\"\"","v":""}]
[{"$f":"\"\"","v":""}]
[{"$f":"\"\"","v":""}]
[{"$f":"\"\"","v":""}]
[{"$f":"\"\"","v":""}]
[{"$f":"\"\"","v":""}]
[{"$f":"\"\"","v":""}]
[{"$f":"\"\"","v":""}]
[{"$f":"\"\"","v":""}]
[{"$f":"\"\"","v":""}]
[{"$f":"\"\"","v":""}]
[{"$f":"\"\"","v":""}]
[{"$f":"\"\"","v":""}]
[{"$f":"\"\"","v":""}]
[{"$f":"\"\"","v":""}]
[{"$f":"\"\"","v":""}]
[{"$f":"\"\"","v":""}]
[{"$f":"\"\"","v":""}]
[{"$f":"\"\"","v":""}]
[{"$f":"\"\"","v":""}]
[{"$f":"\"\"","v":""}]
[{"$f":"\"\"","v":""}]
[{"$f":"\"\"","v":""}]
[{"$f":"\"\"","v":""}]
[{"$f":"\"\"","v":""}]
[{"$f":"\"\"","v":""}]
[{"$f":"\"\"","v":""}]
[{"$f":"\"\"","v":""}]
[{"$f":"\"\"","v":""}]
[{"$f":"\"\"","v":""}]
[{"$f":"\"\"","v":""}]
[{"$f":"\"\"","v":""}]
[{"$f":"\"\"","v":""}]
[{"$f":"\"\"","v":""}]
[{"$f":"\"\"","v":""}]
[{"$f":"\"\"","v":""}]
[{"$f":"\"\"","v":""}]
[{"$f":"\"\"","v":""}]
[{"$f":"\"\"","v":""}]
[{"$f":"\"\"","v":""}]
[{"$f":"\"\"","v":""}]
[{"$f":"\"\"","v":""}]
[{"$f":"\"\"","v":""}]
[{"$f":"\"\"","v":""}]
[{"$f":"\"\"","v":""}]
[{"$f":"\"\"","v":""}]
[{"$f":"\"\"","v":""}]
[{"$f":"\"\"","v":""}]

{"sheet":"MF","index":19,"n_rows":227,"n_cols":1,"rows_kept":227,"cut":false,"hidden":true,"merged":[]}
["2605, 2615, 2625, 2635"]
["4608, 4609, 4610"]
["5609, 5610, 5611, 5612, 5613"]
["6614, 6615, 6616"]
["7619, 7620, 7622 DYNA IV Classic Cab"]
["7619, 7620, 7622 DYNA IV Deluxe & Premium"]
["7619, 7620, 7622 CVT Deluxe & Premium"]
["7624, 7626 DYNA IV Classic Cab"]
["7624, 7626 DYNA IV Deluxe & Premium"]
["7624 CVT Deluxe & Premium Cab"]
["8650, 8660, 8670, 8680 TIER 3 and Tier 4i"]
["5425,35 Tier 2 & 3 Dyna IV (Perkins)"]
["5445,55,60 Tier 2 & 3 Dyna IV (Perkins)"]
["5425, 35, 45, 55, 60 with Speed Shift "]
["5460 Teir 3 DynaIV (SISU)"]
["5465 with Speed Shift TIER 2"]
["5465 with DYNA IV TIER 2"]
["5465,75 Teir 3 Dyna IV (Perkins)"]
["5465,75 Teir 3 Dyna IV (SISU)"]
["6465, 75, 80 with DYNA Shift TIER 2"]
["6465, 75, 80 with DYNA VI TIER 2"]
["6465, 75, 80 with DYNA VI TIER 3 (PERKINS)"]
["6465, 75, 80 with DYNA VI TIER 3 (SISU)"]
["6485, 90, 95 with DYNA Shift TIER 2"]
["6485, 90, 95 with DYNA VI TIER 3"]
["6497, 6499 with DYNA VI TIER 2 (SISU)"]
["6497, 6499 with DYNA VI TIER 3 <176049"]
["6497, 6499 with DYNA VI TIER 3 >T189041"]
["7465, 75, 80 with DYNA VT TIER 2"]
["7485, 90, 95 with DYNA VT TIER 2"]
["7465, 75, 80 with DYNA VT TIER 3 (PERKINS)"]
["7465, 75, 80 with DYNA VT TIER 3 (SISU)"]
["8450, 60, 70, 80"]
["2650, 2660, 2670, 2680 HD"]
["3625, 3635, 3645"]
["431, 461 "]
["471, 481 ROPS"]
["471, 481 CAB"]
["491, 492 ROPS"]
["491, 492 CAB"]
["533, 543, 563"]
["3435, 3445, 3455 F & S Narrow"]
["251XE, 451 "]
["573, 583"]
["593, 596 ROPS"]
["593, 596 CAB"]
["265, 271, 281, 283"]
["271 X/XE, 281 X/XE"]
["4225 - 4355, 4365 (4 Cyl) Cab"]
["4260, 4263, 4270, 4360, 4370 (6 Cyl) Cab"]
["6260 - 6280"]
["6290`"]
["6110 - 6140, 3050 - 3065"]
["6160 - 6180"]
["240, 243, 253, 263"]
["261'"]
["362'"]
["362'"]
["375 - 398 "]
["375 - 398"]
["399'"]
["399'"]
["6150'"]
["4225 - 4355, 4365 (4 Cyl) Rops"]
["4260, 4263, 4270, 4360, 4370 (6 Cyl) Rops"]
[{"$f":"\"\"","v":""}]
["GC2400, 2600 "]
["1529, 1532 "]
["1533,1540, 1635 "]
["1547, 1552, 1648, 1652, 1655 "]
["1560, 1660 "]
["1560, 1660 "]
[{"$f":"\"\"","v":""}]
[{"$f":"\"\"","v":""}]
[{"$f":"\"\"","v":""}]
[{"$f":"\"\"","v":""}]
[{"$f":"\"\"","v":""}]
[{"$f":"\"\"","v":""}]
[{"$f":"\"\"","v":""}]
[{"$f":"\"\"","v":""}]
[{"$f":"\"\"","v":""}]
[{"$f":"\"\"","v":""}]
[{"$f":"\"\"","v":""}]
[{"$f":"\"\"","v":""}]
[{"$f":"\"\"","v":""}]
[{"$f":"\"\"","v":""}]
[{"$f":"\"\"","v":""}]
[{"$f":"\"\"","v":""}]
[{"$f":"\"\"","v":""}]
[{"$f":"\"\"","v":""}]
[{"$f":"\"\"","v":""}]
[{"$f":"\"\"","v":""}]
[{"$f":"\"\"","v":""}]
[{"$f":"\"\"","v":""}]
[{"$f":"\"\"","v":""}]
[{"$f":"\"\"","v":""}]
[{"$f":"\"\"","v":""}]
[{"$f":"\"\"","v":""}]
[{"$f":"\"\"","v":""}]
[{"$f":"\"\"","v":""}]
[{"$f":"\"\"","v":""}]
[{"$f":"\"\"","v":""}]
[{"$f":"\"\"","v":""}]
[{"$f":"\"\"","v":""}]
[{"$f":"\"\"","v":""}]
[{"$f":"\"\"","v":""}]
[{"$f":"\"\"","v":""}]
[{"$f":"\"\"","v":""}]
[{"$f":"\"\"","v":""}]
[{"$f":"\"\"","v":""}]
[{"$f":"\"\"","v":""}]
[{"$f":"\"\"","v":""}]
[{"$f":"\"\"","v":""}]
[{"$f":"\"\"","v":""}]
[{"$f":"\"\"","v":""}]
[{"$f":"\"\"","v":""}]
[{"$f":"\"\"","v":""}]
[{"$f":"\"\"","v":""}]
[{"$f":"\"\"","v":""}]
[{"$f":"\"\"","v":""}]
[{"$f":"\"\"","v":""}]
[{"$f":"\"\"","v":""}]
[{"$f":"\"\"","v":""}]
[{"$f":"\"\"","v":""}]
[{"$f":"\"\"","v":""}]
[{"$f":"\"\"","v":""}]
[{"$f":"\"\"","v":""}]
[{"$f":"\"\"","v":""}]
[{"$f":"\"\"","v":""}]
[{"$f":"\"\"","v":""}]
[{"$f":"\"\"","v":""}]
[{"$f":"\"\"","v":""}]
[{"$f":"\"\"","v":""}]
[{"$f":"\"\"","v":""}]
[{"$f":"\"\"","v":""}]
[{"$f":"\"\"","v":""}]
[{"$f":"\"\"","v":""}]
[{"$f":"\"\"","v":""}]
[{"$f":"\"\"","v":""}]
[{"$f":"\"\"","v":""}]
[{"$f":"\"\"","v":""}]
[{"$f":"\"\"","v":""}]
[{"$f":"\"\"","v":""}]
[{"$f":"\"\"","v":""}]
[{"$f":"\"\"","v":""}]
[{"$f":"\"\"","v":""}]
[{"$f":"\"\"","v":""}]
[{"$f":"\"\"","v":""}]
[{"$f":"\"\"","v":""}]
[{"$f":"\"\"","v":""}]
[{"$f":"\"\"","v":""}]
[{"$f":"\"\"","v":""}]
[{"$f":"\"\"","v":""}]
[{"$f":"\"\"","v":""}]
[{"$f":"\"\"","v":""}]
[{"$f":"\"\"","v":""}]
[{"$f":"\"\"","v":""}]
[{"$f":"\"\"","v":""}]
[{"$f":"\"\"","v":""}]
[{"$f":"\"\"","v":""}]
[{"$f":"\"\"","v":""}]
[{"$f":"\"\"","v":""}]
[{"$f":"\"\"","v":""}]
[{"$f":"\"\"","v":""}]
[{"$f":"\"\"","v":""}]
[{"$f":"\"\"","v":""}]
[{"$f":"\"\"","v":""}]
[{"$f":"\"\"","v":""}]
[{"$f":"\"\"","v":""}]
[{"$f":"\"\"","v":""}]
[{"$f":"\"\"","v":""}]
[{"$f":"\"\"","v":""}]
[{"$f":"\"\"","v":""}]
[{"$f":"\"\"","v":""}]
[{"$f":"\"\"","v":""}]
[{"$f":"\"\"","v":""}]
[{"$f":"\"\"","v":""}]
[{"$f":"\"\"","v":""}]
[{"$f":"\"\"","v":""}]
[{"$f":"\"\"","v":""}]
[{"$f":"\"\"","v":""}]
[{"$f":"\"\"","v":""}]
[{"$f":"\"\"","v":""}]
[{"$f":"\"\"","v":""}]
[{"$f":"\"\"","v":""}]
[{"$f":"\"\"","v":""}]
[{"$f":"\"\"","v":""}]
[{"$f":"\"\"","v":""}]
[{"$f":"\"\"","v":""}]
[{"$f":"\"\"","v":""}]
[{"$f":"\"\"","v":""}]
[{"$f":"\"\"","v":""}]
[{"$f":"\"\"","v":""}]
[{"$f":"\"\"","v":""}]
[{"$f":"\"\"","v":""}]
[{"$f":"\"\"","v":""}]
[{"$f":"\"\"","v":""}]
[{"$f":"\"\"","v":""}]
[{"$f":"\"\"","v":""}]
[{"$f":"\"\"","v":""}]
[{"$f":"\"\"","v":""}]
[{"$f":"\"\"","v":""}]
[{"$f":"\"\"","v":""}]
[{"$f":"\"\"","v":""}]
[{"$f":"\"\"","v":""}]
[{"$f":"\"\"","v":""}]
[{"$f":"\"\"","v":""}]
[{"$f":"\"\"","v":""}]
[{"$f":"\"\"","v":""}]
[{"$f":"\"\"","v":""}]
[{"$f":"\"\"","v":""}]
[{"$f":"\"\"","v":""}]
[{"$f":"\"\"","v":""}]
[{"$f":"\"\"","v":""}]
[{"$f":"\"\"","v":""}]
[{"$f":"\"\"","v":""}]
[{"$f":"\"\"","v":""}]
[{"$f":"\"\"","v":""}]
[{"$f":"\"\"","v":""}]
[{"$f":"\"\"","v":""}]
[{"$f":"\"\"","v":""}]
[{"$f":"\"\"","v":""}]
[{"$f":"\"\"","v":""}]
[{"$f":"\"\"","v":""}]
[{"$f":"\"\"","v":""}]
[{"$f":"\"\"","v":""}]
[{"$f":"\"\"","v":""}]

{"sheet":"McCormick","index":20,"n_rows":188,"n_cols":1,"rows_kept":188,"cut":false,"hidden":true,"merged":[]}
["C-Max 60"]
["C-Max 75 - 105 TIER 2 and 3"]
["T90Max, T100Max, T110Max"]
["C70 - C100"]
["C70 - C100"]
["C60/70/80L"]
["CX70, 75, 80, 85, 90, 95, 100, 105 (Doncaster)"]
["CX90, 100, 110 TIER 3 (Italy)"]
["X50.20, X50.30, X50.40, X50.50"]
["X60.20, X60.30, X60.40, X60.50 "]
["MB55"]
["MB65, 85"]
["MC80, 90, 100 and MC95, 105 TIER 2"]
["MC105,115,130 TIER 3 and MC110 TIER 2"]
["MC120,135 Power VI TIER 2"]
["MC120,135 Power VI TIER 3"]
["MTX 110, 125, 140, 155"]
["MTX 175, 200"]
["MTX \"B\" 120, 135, 145, 150"]
["MTX \"B\" 165, 185"]
["XTX 145, 165 TIER 2 and 3"]
["XTX 185, 200, 215"]
["TTX 190, 210, 230"]
["F75, 85, 95, 105 F/GE Tier 2"]
["F80, 90, 100, 110 Tier 3"]
[{"$f":"\"\"","v":""}]
["X10.25H"]
["X10.40M/HC , X10.50M/HC"]
["X10.55M/C"]
[{"$f":"\"\"","v":""}]
[{"$f":"\"\"","v":""}]
[{"$f":"\"\"","v":""}]
[{"$f":"\"\"","v":""}]
[{"$f":"\"\"","v":""}]
[{"$f":"\"\"","v":""}]
[{"$f":"\"\"","v":""}]
[{"$f":"\"\"","v":""}]
[{"$f":"\"\"","v":""}]
[{"$f":"\"\"","v":""}]
[{"$f":"\"\"","v":""}]
[{"$f":"\"\"","v":""}]
[{"$f":"\"\"","v":""}]
[{"$f":"\"\"","v":""}]
[{"$f":"\"\"","v":""}]
[{"$f":"\"\"","v":""}]
[{"$f":"\"\"","v":""}]
[{"$f":"\"\"","v":""}]
[{"$f":"\"\"","v":""}]
[{"$f":"\"\"","v":""}]
[{"$f":"\"\"","v":""}]
[{"$f":"\"\"","v":""}]
[{"$f":"\"\"","v":""}]
[{"$f":"\"\"","v":""}]
[{"$f":"\"\"","v":""}]
[{"$f":"\"\"","v":""}]
[{"$f":"\"\"","v":""}]
[{"$f":"\"\"","v":""}]
[{"$f":"\"\"","v":""}]
[{"$f":"\"\"","v":""}]
[{"$f":"\"\"","v":""}]
[{"$f":"\"\"","v":""}]
[{"$f":"\"\"","v":""}]
[{"$f":"\"\"","v":""}]
[{"$f":"\"\"","v":""}]
[{"$f":"\"\"","v":""}]
[{"$f":"\"\"","v":""}]
[{"$f":"\"\"","v":""}]
[{"$f":"\"\"","v":""}]
[{"$f":"\"\"","v":""}]
[{"$f":"\"\"","v":""}]
[{"$f":"\"\"","v":""}]
[{"$f":"\"\"","v":""}]
[{"$f":"\"\"","v":""}]
[{"$f":"\"\"","v":""}]
[{"$f":"\"\"","v":""}]
[{"$f":"\"\"","v":""}]
[{"$f":"\"\"","v":""}]
[{"$f":"\"\"","v":""}]
[{"$f":"\"\"","v":""}]
[{"$f":"\"\"","v":""}]
[{"$f":"\"\"","v":""}]
[{"$f":"\"\"","v":""}]
[{"$f":"\"\"","v":""}]
[{"$f":"\"\"","v":""}]
[{"$f":"\"\"","v":""}]
[{"$f":"\"\"","v":""}]
[{"$f":"\"\"","v":""}]
[{"$f":"\"\"","v":""}]
[{"$f":"\"\"","v":""}]
[{"$f":"\"\"","v":""}]
[{"$f":"\"\"","v":""}]
[{"$f":"\"\"","v":""}]
[{"$f":"\"\"","v":""}]
[{"$f":"\"\"","v":""}]
[{"$f":"\"\"","v":""}]
[{"$f":"\"\"","v":""}]
[{"$f":"\"\"","v":""}]
[{"$f":"\"\"","v":""}]
[{"$f":"\"\"","v":""}]
[{"$f":"\"\"","v":""}]
[{"$f":"\"\"","v":""}]
[{"$f":"\"\"","v":""}]
[{"$f":"\"\"","v":""}]
[{"$f":"\"\"","v":""}]
[{"$f":"\"\"","v":""}]
[{"$f":"\"\"","v":""}]
[{"$f":"\"\"","v":""}]
[{"$f":"\"\"","v":""}]
[{"$f":"\"\"","v":""}]
[{"$f":"\"\"","v":""}]
[{"$f":"\"\"","v":""}]
[{"$f":"\"\"","v":""}]
[{"$f":"\"\"","v":""}]
[{"$f":"\"\"","v":""}]
[{"$f":"\"\"","v":""}]
[{"$f":"\"\"","v":""}]
[{"$f":"\"\"","v":""}]
[{"$f":"\"\"","v":""}]
[{"$f":"\"\"","v":""}]
[{"$f":"\"\"","v":""}]
[{"$f":"\"\"","v":""}]
[{"$f":"\"\"","v":""}]
[{"$f":"\"\"","v":""}]
[{"$f":"\"\"","v":""}]
[{"$f":"\"\"","v":""}]
[{"$f":"\"\"","v":""}]
[{"$f":"\"\"","v":""}]
[{"$f":"\"\"","v":""}]
[{"$f":"\"\"","v":""}]
[{"$f":"\"\"","v":""}]
[{"$f":"\"\"","v":""}]
[{"$f":"\"\"","v":""}]
[{"$f":"\"\"","v":""}]
[{"$f":"\"\"","v":""}]
[{"$f":"\"\"","v":""}]
[{"$f":"\"\"","v":""}]
[{"$f":"\"\"","v":""}]
[{"$f":"\"\"","v":""}]
[{"$f":"\"\"","v":""}]
[{"$f":"\"\"","v":""}]
[{"$f":"\"\"","v":""}]
[{"$f":"\"\"","v":""}]
[{"$f":"\"\"","v":""}]
[{"$f":"\"\"","v":""}]
[{"$f":"\"\"","v":""}]
[{"$f":"\"\"","v":""}]
[{"$f":"\"\"","v":""}]
[{"$f":"\"\"","v":""}]
[{"$f":"\"\"","v":""}]
[{"$f":"\"\"","v":""}]
[{"$f":"\"\"","v":""}]
[{"$f":"\"\"","v":""}]
[{"$f":"\"\"","v":""}]
[{"$f":"\"\"","v":""}]
[{"$f":"\"\"","v":""}]
[{"$f":"\"\"","v":""}]
[{"$f":"\"\"","v":""}]
[{"$f":"\"\"","v":""}]
[{"$f":"\"\"","v":""}]
[{"$f":"\"\"","v":""}]
[{"$f":"\"\"","v":""}]
[{"$f":"\"\"","v":""}]
[{"$f":"\"\"","v":""}]
[{"$f":"\"\"","v":""}]
[{"$f":"\"\"","v":""}]
[{"$f":"\"\"","v":""}]
[{"$f":"\"\"","v":""}]
[{"$f":"\"\"","v":""}]
[{"$f":"\"\"","v":""}]
[{"$f":"\"\"","v":""}]
[{"$f":"\"\"","v":""}]
[{"$f":"\"\"","v":""}]
[{"$f":"\"\"","v":""}]
[{"$f":"\"\"","v":""}]
[{"$f":"\"\"","v":""}]
[{"$f":"\"\"","v":""}]
[{"$f":"\"\"","v":""}]
[{"$f":"\"\"","v":""}]
[{"$f":"\"\"","v":""}]
[{"$f":"\"\"","v":""}]
[{"$f":"\"\"","v":""}]
[{"$f":"\"\"","v":""}]
[{"$f":"\"\"","v":""}]
[{"$f":"\"\"","v":""}]
[{"$f":"\"\"","v":""}]
[{"$f":"\"\"","v":""}]
[{"$f":"\"\"","v":""}]
[{"$f":"\"\"","v":""}]

{"sheet":"NH","index":21,"n_rows":87,"n_cols":1,"rows_kept":87,"cut":false,"hidden":true,"merged":[]}
["Workmaster 45, 50, 55, 60, 70"]
["Powerstar T4.65, T4.75 T4B"]
["T4.85 - 120 T4"]
["T5.95 - 120 T4"]
["T6.120, .140, .150, .160"]
["T6.155, .165, .175"]
["T7.170, .185, .200, .210, .235 EP"]
["T7.220, .235, .250, .260, .270 EP"]
["T8.275, .300, .330, .360, .390, .420"]
["TT60A, TT65A,TT75A"]
["Workmaster 65, 75"]
["T4020, T4030"]
["T4020, T4030 Super Steer"]
["T4040, T4050"]
["T4040, T4050 Super Steer"]
["T4030F, T4040F, T4050F"]
["T5030,40,50,60,70"]
["TN55, 65, 75, TN60A, 70A, 75A"]
["TN55D, 65D, 75D, TN60DA, 70DA, 75DA"]
["TN55S, 65S, 70S, 75S, TN60SA, 70SA, 75SA"]
["TN85A, 95A, 85DA, 95DA"]
["TN65F, 75F, 90F, TN75FA, 85FA, 95FA"]
["TD75D, 80D"]
["TD95D"]
["TL 70, 80, 90, 100"]
["TL70A, 80A, 90A, 100A"]
["TS90, 100, 110"]
["TS100A Plus / Deluxe"]
["TS100A, 110A Super Steer"]
["TS110A Standard"]
["TS115A, 125A, 135A Plus / Deluxe"]
["TS115A, 125A, 135A Super Steer"]
["TS115A, 130A Standard"]
["TM120-165"]
["TM120 - 165 Super Steer"]
["TM 175, 190"]
["TM 175, 190 Super Steer"]
["TG 210 - 305 Super Steer"]
["TB100, 110"]
["TB120"]
["4835, 5635, 6635, 7635"]
["5640, 6640, 7740"]
["7840 - 8340"]
["8160, 8260, 8360, 8560"]
["8670, 8770, 8870, 8970"]
["TD 5020, 5030"]
["TD 5040, 5050"]
["TS 6020, 6030"]
["T 6010, 6020 Delta"]
["T 6010 Plus, T 6020 Plus/Elite"]
["T 6020, 6040 & T6060 Elite"]
["T 6010, T6020 Plus/Elite Supersteer"]
["T 6020, 6040 & T6060 Elite Supersteer"]
["T 6030 & T6050 Delta"]
["T 6030, 6050, 6070 Plus/Elite"]
["T 6030, 6050, 6070 Plus/Elite Supersteer"]
["T 7030 + Supersteer"]
["T 7030 CVT + Supersteer"]
["T 7040, 7050, 7060 + CVT"]
["T 7040, 7050, 7060  CVT + Supersteer"]
["T 8020, 8030, 8040, 8050 "]
["T 8020, 8030, 8040, 8050 + Supersteer"]
["3930, 4630"]
["5030'"]
["5610 - 7610"]
["6710 - 7710"]
["7810'"]
["8210'"]
["T1110/Boomer1030"]
["T1530"]
["Boomer 3040,45,50/T2310,2320,2330/TC35-45"]
["Boomer 4055,60/T2410,2420/TC48,55DA"]
["Boomer 30,35"]
["Boomer 40, 50"]
["TC25, TC 29, TC33 +DA"]
["BOOMER 2030,2035,T2210,T2220"]
["TC30, T1510,T1520"]
[{"$f":"\"\"","v":""}]
[]
[{"$f":"\"\"","v":""}]
[{"$f":"\"\"","v":""}]
[{"$f":"\"\"","v":""}]
[{"$f":"\"\"","v":""}]
[{"$f":"\"\"","v":""}]
[{"$f":"\"\"","v":""}]
[{"$f":"\"\"","v":""}]
[{"$f":"\"\"","v":""}]

{"sheet":"Valtra","index":22,"n_rows":180,"n_cols":1,"rows_kept":180,"cut":false,"hidden":true,"merged":[]}
["800, 900"]
["A72, A75, A82, A85, A92, A95"]
["C90, 100, 110, 120, 130, 150"]
["N82, N92"]
["N91, 101,111, 111e, 121, 141"]
["N121ADV, N141ADV"]
["N122, N142 Direct / Versu"]
["T121, 131, 151, 161, 171, 191 Classic"]
["T151, 161, 171, 191 ADV"]
["T120, 130, 140, 160, 170 Classic"]
["T120, 130, 140, 160, 170, 180, 190"]
["6100 - 6850"]
["M120, 130, 150"]
["8000 - 8450"]
["8550 - 8950"]
["600, 700"]
["A65, A75"]
[{"$f":"\"\"","v":""}]
[{"$f":"\"\"","v":""}]
[{"$f":"\"\"","v":""}]
[{"$f":"\"\"","v":""}]
[{"$f":"\"\"","v":""}]
[{"$f":"\"\"","v":""}]
[{"$f":"\"\"","v":""}]
[{"$f":"\"\"","v":""}]
[{"$f":"\"\"","v":""}]
[{"$f":"\"\"","v":""}]
[{"$f":"\"\"","v":""}]
[{"$f":"\"\"","v":""}]
[{"$f":"\"\"","v":""}]
[{"$f":"\"\"","v":""}]
[{"$f":"\"\"","v":""}]
[{"$f":"\"\"","v":""}]
[{"$f":"\"\"","v":""}]
[{"$f":"\"\"","v":""}]
[{"$f":"\"\"","v":""}]
[{"$f":"\"\"","v":""}]
[{"$f":"\"\"","v":""}]
[{"$f":"\"\"","v":""}]
[{"$f":"\"\"","v":""}]
[{"$f":"\"\"","v":""}]
[{"$f":"\"\"","v":""}]
[{"$f":"\"\"","v":""}]
[{"$f":"\"\"","v":""}]
[{"$f":"\"\"","v":""}]
[{"$f":"\"\"","v":""}]
[{"$f":"\"\"","v":""}]
[{"$f":"\"\"","v":""}]
[{"$f":"\"\"","v":""}]
[{"$f":"\"\"","v":""}]
[{"$f":"\"\"","v":""}]
[{"$f":"\"\"","v":""}]
[{"$f":"\"\"","v":""}]
[{"$f":"\"\"","v":""}]
[{"$f":"\"\"","v":""}]
[{"$f":"\"\"","v":""}]
[{"$f":"\"\"","v":""}]
[{"$f":"\"\"","v":""}]
[{"$f":"\"\"","v":""}]
[{"$f":"\"\"","v":""}]
[{"$f":"\"\"","v":""}]
[{"$f":"\"\"","v":""}]
[{"$f":"\"\"","v":""}]
[{"$f":"\"\"","v":""}]
[{"$f":"\"\"","v":""}]
[{"$f":"\"\"","v":""}]
[{"$f":"\"\"","v":""}]
[{"$f":"\"\"","v":""}]
[{"$f":"\"\"","v":""}]
[{"$f":"\"\"","v":""}]
[{"$f":"\"\"","v":""}]
[{"$f":"\"\"","v":""}]
[{"$f":"\"\"","v":""}]
[{"$f":"\"\"","v":""}]
[{"$f":"\"\"","v":""}]
[{"$f":"\"\"","v":""}]
[{"$f":"\"\"","v":""}]
[{"$f":"\"\"","v":""}]
[{"$f":"\"\"","v":""}]
[{"$f":"\"\"","v":""}]
[{"$f":"\"\"","v":""}]
[{"$f":"\"\"","v":""}]
[{"$f":"\"\"","v":""}]
[{"$f":"\"\"","v":""}]
[{"$f":"\"\"","v":""}]
[{"$f":"\"\"","v":""}]
[{"$f":"\"\"","v":""}]
[{"$f":"\"\"","v":""}]
[{"$f":"\"\"","v":""}]
[{"$f":"\"\"","v":""}]
[{"$f":"\"\"","v":""}]
[{"$f":"\"\"","v":""}]
[{"$f":"\"\"","v":""}]
[{"$f":"\"\"","v":""}]
[{"$f":"\"\"","v":""}]
[{"$f":"\"\"","v":""}]
[{"$f":"\"\"","v":""}]
[{"$f":"\"\"","v":""}]
[{"$f":"\"\"","v":""}]
[{"$f":"\"\"","v":""}]
[{"$f":"\"\"","v":""}]
[{"$f":"\"\"","v":""}]
[{"$f":"\"\"","v":""}]
[{"$f":"\"\"","v":""}]
[{"$f":"\"\"","v":""}]
[{"$f":"\"\"","v":""}]
[{"$f":"\"\"","v":""}]
[{"$f":"\"\"","v":""}]
[{"$f":"\"\"","v":""}]
[{"$f":"\"\"","v":""}]
[{"$f":"\"\"","v":""}]
[{"$f":"\"\"","v":""}]
[{"$f":"\"\"","v":""}]
[{"$f":"\"\"","v":""}]
[{"$f":"\"\"","v":""}]
[{"$f":"\"\"","v":""}]
[{"$f":"\"\"","v":""}]
[{"$f":"\"\"","v":""}]
[{"$f":"\"\"","v":""}]
[{"$f":"\"\"","v":""}]
[{"$f":"\"\"","v":""}]
[{"$f":"\"\"","v":""}]
[{"$f":"\"\"","v":""}]
[{"$f":"\"\"","v":""}]
[{"$f":"\"\"","v":""}]
[{"$f":"\"\"","v":""}]
[{"$f":"\"\"","v":""}]
[{"$f":"\"\"","v":""}]
[{"$f":"\"\"","v":""}]
[{"$f":"\"\"","v":""}]
[{"$f":"\"\"","v":""}]
[{"$f":"\"\"","v":""}]
[{"$f":"\"\"","v":""}]
[{"$f":"\"\"","v":""}]
[{"$f":"\"\"","v":""}]
[{"$f":"\"\"","v":""}]
[{"$f":"\"\"","v":""}]
[{"$f":"\"\"","v":""}]
[{"$f":"\"\"","v":""}]
[{"$f":"\"\"","v":""}]
[{"$f":"\"\"","v":""}]
[{"$f":"\"\"","v":""}]
[{"$f":"\"\"","v":""}]
[{"$f":"\"\"","v":""}]
[{"$f":"\"\"","v":""}]
[{"$f":"\"\"","v":""}]
[{"$f":"\"\"","v":""}]
[{"$f":"\"\"","v":""}]
[{"$f":"\"\"","v":""}]
[{"$f":"\"\"","v":""}]
[{"$f":"\"\"","v":""}]
[{"$f":"\"\"","v":""}]
[{"$f":"\"\"","v":""}]
[{"$f":"\"\"","v":""}]
[{"$f":"\"\"","v":""}]
[{"$f":"\"\"","v":""}]
[{"$f":"\"\"","v":""}]
[{"$f":"\"\"","v":""}]
[{"$f":"\"\"","v":""}]
[{"$f":"\"\"","v":""}]
[{"$f":"\"\"","v":""}]
[{"$f":"\"\"","v":""}]
[{"$f":"\"\"","v":""}]
[{"$f":"\"\"","v":""}]
[{"$f":"\"\"","v":""}]
[{"$f":"\"\"","v":""}]
[{"$f":"\"\"","v":""}]
[{"$f":"\"\"","v":""}]
[{"$f":"\"\"","v":""}]
[{"$f":"\"\"","v":""}]
[{"$f":"\"\"","v":""}]
[{"$f":"\"\"","v":""}]
[{"$f":"\"\"","v":""}]
[{"$f":"\"\"","v":""}]
[{"$f":"\"\"","v":""}]
[{"$f":"\"\"","v":""}]
[{"$f":"\"\"","v":""}]
[{"$f":"\"\"","v":""}]
[{"$f":"\"\"","v":""}]
[{"$f":"\"\"","v":""}]

{"sheet":"KIOTI","index":23,"n_rows":480,"n_cols":1,"rows_kept":480,"cut":false,"hidden":true,"merged":[]}
["CK20S, CK20SHST "]
["DK40SE, DK45SE , DK50SE + HST "]
["DK55, DK55C "]
[{"$f":"\"\"","v":""}]
[{"$f":"\"\"","v":""}]
[{"$f":"\"\"","v":""}]
[{"$f":"\"\"","v":""}]
[{"$f":"\"\"","v":""}]
[{"$f":"\"\"","v":""}]
[{"$f":"\"\"","v":""}]
[{"$f":"\"\"","v":""}]
[{"$f":"\"\"","v":""}]
[{"$f":"\"\"","v":""}]
[{"$f":"\"\"","v":""}]
[{"$f":"\"\"","v":""}]
[{"$f":"\"\"","v":""}]
[{"$f":"\"\"","v":""}]
[{"$f":"\"\"","v":""}]
[{"$f":"\"\"","v":""}]
[{"$f":"\"\"","v":""}]
[{"$f":"\"\"","v":""}]
[{"$f":"\"\"","v":""}]
[{"$f":"\"\"","v":""}]
[{"$f":"\"\"","v":""}]
[{"$f":"\"\"","v":""}]
[{"$f":"\"\"","v":""}]
[{"$f":"\"\"","v":""}]
[{"$f":"\"\"","v":""}]
[{"$f":"\"\"","v":""}]
[{"$f":"\"\"","v":""}]
[{"$f":"\"\"","v":""}]
[{"$f":"\"\"","v":""}]
[{"$f":"\"\"","v":""}]
[{"$f":"\"\"","v":""}]
[{"$f":"\"\"","v":""}]
[{"$f":"\"\"","v":""}]
[{"$f":"\"\"","v":""}]
[{"$f":"\"\"","v":""}]
[{"$f":"\"\"","v":""}]
[{"$f":"\"\"","v":""}]
[{"$f":"\"\"","v":""}]
[{"$f":"\"\"","v":""}]
[{"$f":"\"\"","v":""}]
[{"$f":"\"\"","v":""}]
[{"$f":"\"\"","v":""}]
[{"$f":"\"\"","v":""}]
[{"$f":"\"\"","v":""}]
[{"$f":"\"\"","v":""}]
[{"$f":"\"\"","v":""}]
[{"$f":"\"\"","v":""}]
[{"$f":"\"\"","v":""}]
[{"$f":"\"\"","v":""}]
[{"$f":"\"\"","v":""}]
[{"$f":"\"\"","v":""}]
[{"$f":"\"\"","v":""}]
[{"$f":"\"\"","v":""}]
[{"$f":"\"\"","v":""}]
[{"$f":"\"\"","v":""}]
[{"$f":"\"\"","v":""}]
[{"$f":"\"\"","v":""}]
[{"$f":"\"\"","v":""}]
[{"$f":"\"\"","v":""}]
[{"$f":"\"\"","v":""}]
[{"$f":"\"\"","v":""}]
[{"$f":"\"\"","v":""}]
[{"$f":"\"\"","v":""}]
[{"$f":"\"\"","v":""}]
[{"$f":"\"\"","v":""}]
[{"$f":"\"\"","v":""}]
[{"$f":"\"\"","v":""}]
[{"$f":"\"\"","v":""}]
[{"$f":"\"\"","v":""}]
[{"$f":"\"\"","v":""}]
[{"$f":"\"\"","v":""}]
[{"$f":"\"\"","v":""}]
[{"$f":"\"\"","v":""}]
[{"$f":"\"\"","v":""}]
[{"$f":"\"\"","v":""}]
[{"$f":"\"\"","v":""}]
[{"$f":"\"\"","v":""}]
[{"$f":"\"\"","v":""}]
[{"$f":"\"\"","v":""}]
[{"$f":"\"\"","v":""}]
[{"$f":"\"\"","v":""}]
[{"$f":"\"\"","v":""}]
[{"$f":"\"\"","v":""}]
[{"$f":"\"\"","v":""}]
[{"$f":"\"\"","v":""}]
[{"$f":"\"\"","v":""}]
[{"$f":"\"\"","v":""}]
[{"$f":"\"\"","v":""}]
[{"$f":"\"\"","v":""}]
[{"$f":"\"\"","v":""}]
[{"$f":"\"\"","v":""}]
[{"$f":"\"\"","v":""}]
[{"$f":"\"\"","v":""}]
[{"$f":"\"\"","v":""}]
[{"$f":"\"\"","v":""}]
[{"$f":"\"\"","v":""}]
[{"$f":"\"\"","v":""}]
[{"$f":"\"\"","v":""}]
[{"$f":"\"\"","v":""}]
[{"$f":"\"\"","v":""}]
[{"$f":"\"\"","v":""}]
[{"$f":"\"\"","v":""}]
[{"$f":"\"\"","v":""}]
[{"$f":"\"\"","v":""}]
[{"$f":"\"\"","v":""}]
[{"$f":"\"\"","v":""}]
[{"$f":"\"\"","v":""}]
[{"$f":"\"\"","v":""}]
[{"$f":"\"\"","v":""}]
[{"$f":"\"\"","v":""}]
[{"$f":"\"\"","v":""}]
[{"$f":"\"\"","v":""}]
[{"$f":"\"\"","v":""}]
[{"$f":"\"\"","v":""}]
[{"$f":"\"\"","v":""}]
[{"$f":"\"\"","v":""}]
[{"$f":"\"\"","v":""}]
[{"$f":"\"\"","v":""}]
[{"$f":"\"\"","v":""}]
[{"$f":"\"\"","v":""}]
[{"$f":"\"\"","v":""}]
[{"$f":"\"\"","v":""}]
[{"$f":"\"\"","v":""}]
[{"$f":"\"\"","v":""}]
[{"$f":"\"\"","v":""}]
[{"$f":"\"\"","v":""}]
[{"$f":"\"\"","v":""}]
[{"$f":"\"\"","v":""}]
[{"$f":"\"\"","v":""}]
[{"$f":"\"\"","v":""}]
[{"$f":"\"\"","v":""}]
[{"$f":"\"\"","v":""}]
[{"$f":"\"\"","v":""}]
[{"$f":"\"\"","v":""}]
[{"$f":"\"\"","v":""}]
[{"$f":"\"\"","v":""}]
[{"$f":"\"\"","v":""}]
[{"$f":"\"\"","v":""}]
[{"$f":"\"\"","v":""}]
[{"$f":"\"\"","v":""}]
[{"$f":"\"\"","v":""}]
[{"$f":"\"\"","v":""}]
[{"$f":"\"\"","v":""}]
[{"$f":"\"\"","v":""}]
[{"$f":"\"\"","v":""}]
[{"$f":"\"\"","v":""}]
[{"$f":"\"\"","v":""}]
[{"$f":"\"\"","v":""}]
[{"$f":"\"\"","v":""}]
[{"$f":"\"\"","v":""}]
[{"$f":"\"\"","v":""}]
[{"$f":"\"\"","v":""}]
[{"$f":"\"\"","v":""}]
[{"$f":"\"\"","v":""}]
[{"$f":"\"\"","v":""}]
[{"$f":"\"\"","v":""}]
[{"$f":"\"\"","v":""}]
[{"$f":"\"\"","v":""}]
[{"$f":"\"\"","v":""}]
[{"$f":"\"\"","v":""}]
[{"$f":"\"\"","v":""}]
[{"$f":"\"\"","v":""}]
[{"$f":"\"\"","v":""}]
[{"$f":"\"\"","v":""}]
[{"$f":"\"\"","v":""}]
[{"$f":"\"\"","v":""}]
[{"$f":"\"\"","v":""}]
[{"$f":"\"\"","v":""}]
[{"$f":"\"\"","v":""}]
[{"$f":"\"\"","v":""}]
[{"$f":"\"\"","v":""}]
[{"$f":"\"\"","v":""}]
[{"$f":"\"\"","v":""}]
[{"$f":"\"\"","v":""}]
[{"$f":"\"\"","v":""}]
[{"$f":"\"\"","v":""}]
[{"$f":"\"\"","v":""}]
[{"$f":"\"\"","v":""}]
[{"$f":"\"\"","v":""}]
[{"$f":"\"\"","v":""}]
[{"$f":"\"\"","v":""}]
[{"$f":"\"\"","v":""}]
[{"$f":"\"\"","v":""}]
[{"$f":"\"\"","v":""}]
[{"$f":"\"\"","v":""}]
[{"$f":"\"\"","v":""}]
[{"$f":"\"\"","v":""}]
[{"$f":"\"\"","v":""}]
[{"$f":"\"\"","v":""}]
[{"$f":"\"\"","v":""}]
[{"$f":"\"\"","v":""}]
[{"$f":"\"\"","v":""}]
[{"$f":"\"\"","v":""}]
[{"$f":"\"\"","v":""}]
[{"$f":"\"\"","v":""}]
[{"$f":"\"\"","v":""}]
[{"$f":"\"\"","v":""}]
[{"$f":"\"\"","v":""}]
[{"$f":"\"\"","v":""}]
[{"$f":"\"\"","v":""}]
[{"$f":"\"\"","v":""}]
[{"$f":"\"\"","v":""}]
[{"$f":"\"\"","v":""}]
[{"$f":"\"\"","v":""}]
[{"$f":"\"\"","v":""}]
[{"$f":"\"\"","v":""}]
[{"$f":"\"\"","v":""}]
[{"$f":"\"\"","v":""}]
[{"$f":"\"\"","v":""}]
[{"$f":"\"\"","v":""}]
[{"$f":"\"\"","v":""}]
[{"$f":"\"\"","v":""}]
[{"$f":"\"\"","v":""}]
[{"$f":"\"\"","v":""}]
[{"$f":"\"\"","v":""}]
[{"$f":"\"\"","v":""}]
[{"$f":"\"\"","v":""}]
[{"$f":"\"\"","v":""}]
[{"$f":"\"\"","v":""}]
[{"$f":"\"\"","v":""}]
[{"$f":"\"\"","v":""}]
[{"$f":"\"\"","v":""}]
[{"$f":"\"\"","v":""}]
[{"$f":"\"\"","v":""}]
[{"$f":"\"\"","v":""}]
[{"$f":"\"\"","v":""}]
[{"$f":"\"\"","v":""}]
[{"$f":"\"\"","v":""}]
[{"$f":"\"\"","v":""}]
[{"$f":"\"\"","v":""}]
[{"$f":"\"\"","v":""}]
[{"$f":"\"\"","v":""}]
[{"$f":"\"\"","v":""}]
[{"$f":"\"\"","v":""}]
[{"$f":"\"\"","v":""}]
[{"$f":"\"\"","v":""}]
[{"$f":"\"\"","v":""}]
[{"$f":"\"\"","v":""}]
[{"$f":"\"\"","v":""}]
[{"$f":"\"\"","v":""}]
[{"$f":"\"\"","v":""}]
[{"$f":"\"\"","v":""}]
[{"$f":"\"\"","v":""}]
[{"$f":"\"\"","v":""}]
[{"$f":"\"\"","v":""}]
[{"$f":"\"\"","v":""}]
[{"$f":"\"\"","v":""}]
[{"$f":"\"\"","v":""}]
[{"$f":"\"\"","v":""}]
[{"$f":"\"\"","v":""}]
[{"$f":"\"\"","v":""}]
[{"$f":"\"\"","v":""}]
[{"$f":"\"\"","v":""}]
[{"$f":"\"\"","v":""}]
[{"$f":"\"\"","v":""}]
[{"$f":"\"\"","v":""}]
[{"$f":"\"\"","v":""}]
[{"$f":"\"\"","v":""}]
[{"$f":"\"\"","v":""}]
[{"$f":"\"\"","v":""}]
[{"$f":"\"\"","v":""}]
[{"$f":"\"\"","v":""}]
[{"$f":"\"\"","v":""}]
[{"$f":"\"\"","v":""}]
[{"$f":"\"\"","v":""}]
[{"$f":"\"\"","v":""}]
[{"$f":"\"\"","v":""}]
[{"$f":"\"\"","v":""}]
[{"$f":"\"\"","v":""}]
[{"$f":"\"\"","v":""}]
[{"$f":"\"\"","v":""}]
[{"$f":"\"\"","v":""}]
[{"$f":"\"\"","v":""}]
[{"$f":"\"\"","v":""}]
[{"$f":"\"\"","v":""}]
[{"$f":"\"\"","v":""}]
[{"$f":"\"\"","v":""}]
[{"$f":"\"\"","v":""}]
[{"$f":"\"\"","v":""}]
[{"$f":"\"\"","v":""}]
[{"$f":"\"\"","v":""}]
[{"$f":"\"\"","v":""}]
[{"$f":"\"\"","v":""}]
[{"$f":"\"\"","v":""}]
[{"$f":"\"\"","v":""}]
[{"$f":"\"\"","v":""}]
[{"$f":"\"\"","v":""}]
[{"$f":"\"\"","v":""}]
[{"$f":"\"\"","v":""}]
[{"$f":"\"\"","v":""}]
[{"$f":"\"\"","v":""}]
[{"$f":"\"\"","v":""}]
[{"$f":"\"\"","v":""}]
[{"$f":"\"\"","v":""}]
[{"$f":"\"\"","v":""}]
[{"$f":"\"\"","v":""}]
[{"$f":"\"\"","v":""}]
[{"$f":"\"\"","v":""}]
[{"$f":"\"\"","v":""}]
[{"$f":"\"\"","v":""}]
[{"$f":"\"\"","v":""}]
[{"$f":"\"\"","v":""}]
[{"$f":"\"\"","v":""}]
[{"$f":"\"\"","v":""}]
[{"$f":"\"\"","v":""}]
[{"$f":"\"\"","v":""}]
[{"$f":"\"\"","v":""}]
[{"$f":"\"\"","v":""}]
[{"$f":"\"\"","v":""}]
[{"$f":"\"\"","v":""}]
[{"$f":"\"\"","v":""}]
[{"$f":"\"\"","v":""}]
[{"$f":"\"\"","v":""}]
[{"$f":"\"\"","v":""}]
[{"$f":"\"\"","v":""}]
[{"$f":"\"\"","v":""}]
[{"$f":"\"\"","v":""}]
[{"$f":"\"\"","v":""}]
[{"$f":"\"\"","v":""}]
[{"$f":"\"\"","v":""}]
[{"$f":"\"\"","v":""}]
[{"$f":"\"\"","v":""}]
[{"$f":"\"\"","v":""}]
[{"$f":"\"\"","v":""}]
[{"$f":"\"\"","v":""}]
[{"$f":"\"\"","v":""}]
[{"$f":"\"\"","v":""}]
[{"$f":"\"\"","v":""}]
[{"$f":"\"\"","v":""}]
[{"$f":"\"\"","v":""}]
[{"$f":"\"\"","v":""}]
[{"$f":"\"\"","v":""}]
[{"$f":"\"\"","v":""}]
[{"$f":"\"\"","v":""}]
[{"$f":"\"\"","v":""}]
[{"$f":"\"\"","v":""}]
[{"$f":"\"\"","v":""}]
[{"$f":"\"\"","v":""}]
[{"$f":"\"\"","v":""}]
[{"$f":"\"\"","v":""}]
[{"$f":"\"\"","v":""}]
[{"$f":"\"\"","v":""}]
[{"$f":"\"\"","v":""}]
[{"$f":"\"\"","v":""}]
[{"$f":"\"\"","v":""}]
[{"$f":"\"\"","v":""}]
[{"$f":"\"\"","v":""}]
[{"$f":"\"\"","v":""}]
[{"$f":"\"\"","v":""}]
[{"$f":"\"\"","v":""}]
[{"$f":"\"\"","v":""}]
[{"$f":"\"\"","v":""}]
[{"$f":"\"\"","v":""}]
[{"$f":"\"\"","v":""}]
[{"$f":"\"\"","v":""}]
[{"$f":"\"\"","v":""}]
[{"$f":"\"\"","v":""}]
[{"$f":"\"\"","v":""}]
[{"$f":"\"\"","v":""}]
[{"$f":"\"\"","v":""}]
[{"$f":"\"\"","v":""}]
[{"$f":"\"\"","v":""}]
[{"$f":"\"\"","v":""}]
[{"$f":"\"\"","v":""}]
[{"$f":"\"\"","v":""}]
[{"$f":"\"\"","v":""}]
[{"$f":"\"\"","v":""}]
[{"$f":"\"\"","v":""}]
[{"$f":"\"\"","v":""}]
[{"$f":"\"\"","v":""}]
[{"$f":"\"\"","v":""}]
[{"$f":"\"\"","v":""}]
[{"$f":"\"\"","v":""}]
[{"$f":"\"\"","v":""}]
[{"$f":"\"\"","v":""}]
[{"$f":"\"\"","v":""}]
[{"$f":"\"\"","v":""}]
[{"$f":"\"\"","v":""}]
[{"$f":"\"\"","v":""}]
[{"$f":"\"\"","v":""}]
[{"$f":"\"\"","v":""}]
[{"$f":"\"\"","v":""}]
[{"$f":"\"\"","v":""}]
[{"$f":"\"\"","v":""}]
[{"$f":"\"\"","v":""}]
[{"$f":"\"\"","v":""}]
[{"$f":"\"\"","v":""}]
[{"$f":"\"\"","v":""}]
[{"$f":"\"\"","v":""}]
[{"$f":"\"\"","v":""}]
[{"$f":"\"\"","v":""}]
[{"$f":"\"\"","v":""}]
[{"$f":"\"\"","v":""}]
[{"$f":"\"\"","v":""}]
[{"$f":"\"\"","v":""}]
[{"$f":"\"\"","v":""}]
[{"$f":"\"\"","v":""}]
[{"$f":"\"\"","v":""}]
[{"$f":"\"\"","v":""}]
[{"$f":"\"\"","v":""}]
[{"$f":"\"\"","v":""}]
[{"$f":"\"\"","v":""}]
[{"$f":"\"\"","v":""}]
[{"$f":"\"\"","v":""}]
[{"$f":"\"\"","v":""}]
[{"$f":"\"\"","v":""}]
[{"$f":"\"\"","v":""}]
[{"$f":"\"\"","v":""}]
[{"$f":"\"\"","v":""}]
[{"$f":"\"\"","v":""}]
[{"$f":"\"\"","v":""}]
[{"$f":"\"\"","v":""}]
[{"$f":"\"\"","v":""}]
[{"$f":"\"\"","v":""}]
[{"$f":"\"\"","v":""}]
[{"$f":"\"\"","v":""}]
[{"$f":"\"\"","v":""}]
[{"$f":"\"\"","v":""}]
[{"$f":"\"\"","v":""}]
[{"$f":"\"\"","v":""}]
[{"$f":"\"\"","v":""}]
[{"$f":"\"\"","v":""}]
[{"$f":"\"\"","v":""}]
[{"$f":"\"\"","v":""}]
[{"$f":"\"\"","v":""}]
[{"$f":"\"\"","v":""}]
[{"$f":"\"\"","v":""}]
[{"$f":"\"\"","v":""}]
[{"$f":"\"\"","v":""}]
[{"$f":"\"\"","v":""}]
[{"$f":"\"\"","v":""}]
[{"$f":"\"\"","v":""}]
[{"$f":"\"\"","v":""}]
[{"$f":"\"\"","v":""}]
[{"$f":"\"\"","v":""}]
[{"$f":"\"\"","v":""}]
[{"$f":"\"\"","v":""}]
[{"$f":"\"\"","v":""}]
[{"$f":"\"\"","v":""}]
[{"$f":"\"\"","v":""}]
[{"$f":"\"\"","v":""}]
[{"$f":"\"\"","v":""}]
[{"$f":"\"\"","v":""}]
[{"$f":"\"\"","v":""}]
[{"$f":"\"\"","v":""}]
[{"$f":"\"\"","v":""}]
[{"$f":"\"\"","v":""}]
[{"$f":"\"\"","v":""}]
[{"$f":"\"\"","v":""}]
[{"$f":"\"\"","v":""}]
[{"$f":"\"\"","v":""}]
[{"$f":"\"\"","v":""}]
[{"$f":"\"\"","v":""}]
[{"$f":"\"\"","v":""}]
[{"$f":"\"\"","v":""}]
[{"$f":"\"\"","v":""}]
[{"$f":"\"\"","v":""}]
[{"$f":"\"\"","v":""}]
[{"$f":"\"\"","v":""}]
[{"$f":"\"\"","v":""}]
[{"$f":"\"\"","v":""}]
[{"$f":"\"\"","v":""}]
[{"$f":"\"\"","v":""}]
[{"$f":"\"\"","v":""}]
[{"$f":"\"\"","v":""}]
[{"$f":"\"\"","v":""}]
[{"$f":"\"\"","v":""}]
[{"$f":"\"\"","v":""}]
[{"$f":"\"\"","v":""}]
[{"$f":"\"\"","v":""}]
[{"$f":"\"\"","v":""}]
[{"$f":"\"\"","v":""}]
[{"$f":"\"\"","v":""}]
[{"$f":"\"\"","v":""}]
[{"$f":"\"\"","v":""}]
[{"$f":"\"\"","v":""}]
[{"$f":"\"\"","v":""}]

{"sheet":"MAHINDRA","index":24,"n_rows":126,"n_cols":1,"rows_kept":126,"cut":false,"hidden":true,"merged":[]}
["5010'"]
["5035'"]
[{"$f":"\"\"","v":""}]
[{"$f":"\"\"","v":""}]
[{"$f":"\"\"","v":""}]
[{"$f":"\"\"","v":""}]
[{"$f":"\"\"","v":""}]
[{"$f":"\"\"","v":""}]
[{"$f":"\"\"","v":""}]
[{"$f":"\"\"","v":""}]
[{"$f":"\"\"","v":""}]
[{"$f":"\"\"","v":""}]
[{"$f":"\"\"","v":""}]
[{"$f":"\"\"","v":""}]
[{"$f":"\"\"","v":""}]
[{"$f":"\"\"","v":""}]
[{"$f":"\"\"","v":""}]
[{"$f":"\"\"","v":""}]
[{"$f":"\"\"","v":""}]
[{"$f":"\"\"","v":""}]
[{"$f":"\"\"","v":""}]
[{"$f":"\"\"","v":""}]
[{"$f":"\"\"","v":""}]
[{"$f":"\"\"","v":""}]
[{"$f":"\"\"","v":""}]
[{"$f":"\"\"","v":""}]
[{"$f":"\"\"","v":""}]
[{"$f":"\"\"","v":""}]
[{"$f":"\"\"","v":""}]
[{"$f":"\"\"","v":""}]
[{"$f":"\"\"","v":""}]
[{"$f":"\"\"","v":""}]
[{"$f":"\"\"","v":""}]
[{"$f":"\"\"","v":""}]
[{"$f":"\"\"","v":""}]
[{"$f":"\"\"","v":""}]
[{"$f":"\"\"","v":""}]
[{"$f":"\"\"","v":""}]
[{"$f":"\"\"","v":""}]
[{"$f":"\"\"","v":""}]
[{"$f":"\"\"","v":""}]
[{"$f":"\"\"","v":""}]
[{"$f":"\"\"","v":""}]
[{"$f":"\"\"","v":""}]
[{"$f":"\"\"","v":""}]
[{"$f":"\"\"","v":""}]
[{"$f":"\"\"","v":""}]
[{"$f":"\"\"","v":""}]
[{"$f":"\"\"","v":""}]
[{"$f":"\"\"","v":""}]
[{"$f":"\"\"","v":""}]
[{"$f":"\"\"","v":""}]
[{"$f":"\"\"","v":""}]
[{"$f":"\"\"","v":""}]
[{"$f":"\"\"","v":""}]
[{"$f":"\"\"","v":""}]
[{"$f":"\"\"","v":""}]
[{"$f":"\"\"","v":""}]
[{"$f":"\"\"","v":""}]
[{"$f":"\"\"","v":""}]
[{"$f":"\"\"","v":""}]
[{"$f":"\"\"","v":""}]
[{"$f":"\"\"","v":""}]
[{"$f":"\"\"","v":""}]
[{"$f":"\"\"","v":""}]
[{"$f":"\"\"","v":""}]
[{"$f":"\"\"","v":""}]
[{"$f":"\"\"","v":""}]
[{"$f":"\"\"","v":""}]
[{"$f":"\"\"","v":""}]
[{"$f":"\"\"","v":""}]
[{"$f":"\"\"","v":""}]
[{"$f":"\"\"","v":""}]
[{"$f":"\"\"","v":""}]
[{"$f":"\"\"","v":""}]
[{"$f":"\"\"","v":""}]
[{"$f":"\"\"","v":""}]
[{"$f":"\"\"","v":""}]
[{"$f":"\"\"","v":""}]
[{"$f":"\"\"","v":""}]
[{"$f":"\"\"","v":""}]
[{"$f":"\"\"","v":""}]
[{"$f":"\"\"","v":""}]
[{"$f":"\"\"","v":""}]
[{"$f":"\"\"","v":""}]
[{"$f":"\"\"","v":""}]
[{"$f":"\"\"","v":""}]
[{"$f":"\"\"","v":""}]
[{"$f":"\"\"","v":""}]
[{"$f":"\"\"","v":""}]
[{"$f":"\"\"","v":""}]
[{"$f":"\"\"","v":""}]
[{"$f":"\"\"","v":""}]
[{"$f":"\"\"","v":""}]
[{"$f":"\"\"","v":""}]
[{"$f":"\"\"","v":""}]
[{"$f":"\"\"","v":""}]
[{"$f":"\"\"","v":""}]
[{"$f":"\"\"","v":""}]
[{"$f":"\"\"","v":""}]
[{"$f":"\"\"","v":""}]
[{"$f":"\"\"","v":""}]
[{"$f":"\"\"","v":""}]
[{"$f":"\"\"","v":""}]
[{"$f":"\"\"","v":""}]
[{"$f":"\"\"","v":""}]
[{"$f":"\"\"","v":""}]
[{"$f":"\"\"","v":""}]
[{"$f":"\"\"","v":""}]
[{"$f":"\"\"","v":""}]
[{"$f":"\"\"","v":""}]
[{"$f":"\"\"","v":""}]
[{"$f":"\"\"","v":""}]
[{"$f":"\"\"","v":""}]
[{"$f":"\"\"","v":""}]
[{"$f":"\"\"","v":""}]
[{"$f":"\"\"","v":""}]
[{"$f":"\"\"","v":""}]
[{"$f":"\"\"","v":""}]
[{"$f":"\"\"","v":""}]
[{"$f":"\"\"","v":""}]
[{"$f":"\"\"","v":""}]
[{"$f":"\"\"","v":""}]
[{"$f":"\"\"","v":""}]
[{"$f":"\"\"","v":""}]
[{"$f":"\"\"","v":""}]