{"text_format":"1","workbook":"xlsx","n_sheets":25,"sheets":["Prices","Notes","Implements","Buckets","LOADERpro","Options","trip costs","Loader Details","OEM","AGCO","AGCO Allis","AGCO White","Buhler","Case","Challenger","Deutz","John Deere","Kubota","Landini","MF","McCormick","NH","Valtra","KIOTI","MAHINDRA"],"not_rendered":{"charts":0,"images":9,"macros":1,"external_links":1,"defined_names":16,"comments":0,"pivot_tables":0},"unopened":[],"bounds":{"document_bytes":16777216,"sheet_cells":100000,"rows_first":2000,"rows_last":500,"rows_between":2000,"halvings":0,"cell_chars":16384,"cell_head_chars":4096},"cells_cut":0,"cells_raw":0,"read":"whole","date_system":"1900"}

{"sheet":"Prices","index":0,"n_rows":1861,"n_cols":5,"rows_kept":1861,"cut":false,"hidden":true,"merged":[]}
["Vendor PN","Vendor Description","List Price","Vendor PN","Vendor PN"]
[245099,"HYDR IMPL.LOCK.SET",615,{"$f":"C2*1.05*1.05","v":678.03750000000002},245099]
[246616,"HYDR IMPL.LOCK.SET EURO",615,{"$f":"C3*1.05*1.05","v":678.03750000000002},246616]
[246800,"HYDR.IMPLEM.LOCK. EURO/E-FAUCH",615,678.03750000000002,246800]
[301605,"SELECTO FIX MK3(3) REDSKAPSDEL",331,364.92750000000001,301605]
[301607,"SELECTO FIX MK3(3) LASTARDEL",331,364.92750000000001,301607]
[301852,"HOSE SET WITH SEC.VALVE",530,584.32500000000005,301852]
[301921,"AAC Q710-770, Q920-Q10·80",331,364.92750000000001,301921]
[313325,"SELECTO 4 MK3",362,399.10500000000002,313325]
[313411,"LEVER KIT SELECTO",169,186.32250000000002,313411]
{"$rows_left_out":1852}
{"sheet":"Notes","index":1,"n_rows":128,"n_cols":2,"rows_kept":128,"cut":false,"hidden":true,"merged":[]}
["Note #","Description"]
[]
[{"$f":"A2+1","v":1},"Hydraulic Set 15097BFA for Load Sense tractors "]
[{"$f":"A3+1","v":2},"Deluxe Hose Set  for use with factory blue joystick"]
[3,"Subframe adapted for tractors with/without 2.5 tonne front hitch"]
[4,"DS Subframe 900mm - order a DS Base Loader"]
[5,"For Tractors with Underslung Exhaust"]
[6,"For Tractors with Vertical Cab Corner Post Exhaust"]
[7,"Deluxe hose kit is only compatible prior to SN T262090"]
[8,"Front weight bracket must be removed"]
{"$rows_left_out":119}
{"sheet":"Implements","index":2,"n_rows":49,"n_cols":20,"rows_kept":49,"cut":false,"hidden":true,"merged":[]}
["EURO"]
["Q21","11254051F","11251728F","11252718F","11252738F","11252748F","11250768F","11250178F","11252008F","11252018F"]
["Q26","11254051F","11251728F","11252718F","11252738F","11252748F","11250768F","11250178F","11252008F","11252018F"]
["Q31","11254051F","11251728F","11252718F","11252738F","11252748F","11250768F","11250178F","11252008F","11252018F"]
["Q36","11254051F","11251728F","11252718F","11252738F","11252748F","11250768F","11250178F","11252008F","11252018F"]
["Q41","11254051F","11251728F","11252738F","11252748F","11250533F","11250536F","11250534F","11250537F","11250768F","11250358F","11252008F","11252018F",null,null,null,null,null,"11251698F","There is a special offer if you order 5 or more of this item!"]
["Q46","11254051F","11251728F","11252738F","11252748F","11250533F","11250536F","11250534F","11250537F","11250768F","11250358F","11252008F","11252018F",null,null,null,null,null,"11251728F","There is a special offer if you order 5 or more of this item!"]
["Q51","11254051F","11251728F","11252738F","11252748F","11250533F","11250536F","11250534F","11250537F","11250768F","11250358F","11252008F","11252018F",null,null,null,null,null,"11252738F",{"$f":"\"\"","v":""}]
["Q56","11254051F","11251728F","11252738F","11252748F","11250533F","11250536F","11250534F","11250537F","11250768F","11250358F","11252008F","11252018F",null,null,null,null,null,"11252748F",{"$f":"\"\"","v":""}]
["Q61","11254051F","11251728F","11252738F","11252748F","11250533F","11250536F","11250534F","11250537F","11250768F","11250358F","11252008F","11252018F",null,null,null,null,null,"11250533F",{"$f":"\"\"","v":""}]
{"$rows_left_out":40}
{"sheet":"Buckets","index":3,"n_rows":53,"n_cols":10,"rows_kept":53,"cut":false,"hidden":true,"merged":[]}
["EURO Buckets"]
["Q21","11251588F","11251598F","11251038F","11251048F","11251128F","11251138F","11252158F",{"$f":"\"\"","v":""}]
["Q26","11251588F","11251598F","11251038F","11251048F","11251128F","11251138F","11252158F",{"$f":"\"\"","v":""}]
["Q31","11251588F","11251598F","11251038F","11251048F","11251128F","11251138F","11251078F","11251158F","11252158F"]
["Q36","11251588F","11251598F","11251038F","11251048F","11251128F","11251138F","11251078F","11251158F","11252158F"]
["Q41","11251038F","11251048F","11251058F","11251078F","11251148F","11251158F","11252158F",{"$f":"\"\"","v":""}]
["Q46","11251038F","11251048F","11251058F","11251078F","11251148F","11251158F","11252158F",{"$f":"\"\"","v":""}]
["Q51","11251038F","11251048F","11251058F","11251078F","11251088F","11251158F","11251808F","11252158F"]
["Q56","11251038F","11251048F","11251058F","11251078F","11251088F","11251158F","11251808F","11252158F"]
["Q61","11251048F","11251058F","11251078F","11251088F","11251808F","11251818F",{"$f":"\"\"","v":""},{"$f":"\"\"","v":""}]
{"$rows_left_out":44}
{"sheet":"LOADERpro","index":4,"n_rows":122,"n_cols":36,"rows_kept":122,"cut":false,"hidden":false,"merged":[[2,2,2,7],[6,10,6,12],[4,10,4,12],[2,10,2,12],[4,8,4,9],[6,8,6,9],[2,8,2,9],[42,9,42,10],[8,10,8,12],[17,2,17,11],[20,2,20,14],[4,2,4,7],[16,6,16,7],[13,1,13,2],[11,1,11,2],[16,4,16,5],[8,5,8,6],[23,8,23,9],[37,9,37,10],[27,11,27,14],[30,11,30,14],[16,13,16,14],[6,2,6,7],[48,1,48,12],[36,12,36,14],[33,11,33,14],[31,11,31,14],[46,11,46,14],[46,9,46,10],[40,2,40,4],[32,9,32,10],[32,5,32,8],[47,9,47,11],[32,11,32,14],[44,11,45,14],[40,5,40,10],[44,9,45,10],[41,12,41,14],[42,11,42,14],[0,8,0,14],[18,2,18,14],[38,9,38,10],[33,2,33,8],[19,2,19,14],[35,2,35,4],[21,2,21,14],[31,9,31,10],[33,9,33,10],[35,5,35,10],[29,4,29,14],[28,9,28,10],[30,9,30,10],[35,11,35,14],[37,11,37,14],[38,11,38,14],[40,11,40,14],[23,10,23,12],[24,11,24,14],[26,11,26,14],[29,1,29,3],[28,11,28,14],[27,9,27,10],[25,11,25,14],[24,1,24,2],[25,1,25,2]]}
[null,null,null,null,null,null,null,null,"LOADERpro17.1"]
[]
[null,"Dealer Name:",null,null,null,null,null,null,"Date:",null,null,null,null,null,null,null,null,null,null,null,"Note 1",{"$f":"VLOOKUP(T$11,loaders,5,0)","v":{"$error":"#N/A"}},{"$f":"VLOOKUP(V3,notes,2,0)","v":{"$error":"#N/A"}}]
[null,null,null,null,null,null,null,null,null,null,null,null,null,null,null,null,null,null,null,null,"Note 2",{"$f":"VLOOKUP(T$11,loaders,6,0)","v":{"$error":"#N/A"}},{"$f":"VLOOKUP(V4,notes,2,0)","v":{"$error":"#N/A"}}]
[null,"Contact:",null,null,null,null,null,null,"P.O. No.",null,null,null,null,null,null,null,null,{"$f":"IF(VLOOKUP(P19,Options!A1:E25,4,0)>15,\"EURO\",\"\")","v":{"$error":"#N/A"}},null,null,"Note 3",{"$f":"VLOOKUP(T$11,loaders,7,0)","v":{"$error":"#N/A"}},{"$f":"VLOOKUP(V5,notes,2,0)","v":{"$error":"#N/A"}},{"$f":"IF(ISERROR(R5),\"\",R5)","v":""}]
[null,null,null,null,null,null,null,null,null,null,null,null,null,null,null,null,null,{"$f":"IF(VLOOKUP(P19,Options!A1:E25,4,0)<=15,\"\",IF(VLOOKUP(P19,Options!A1:E25,4,0)>=47,\"\",\"SKID STEER\"))","v":{"$error":"#N/A"}},null,null,"Note 4",{"$f":"VLOOKUP(T$11,loaders,8,0)","v":{"$error":"#N/A"}},{"$f":"VLOOKUP(V6,notes,2,0)","v":{"$error":"#N/A"}},{"$f":"IF(ISERROR(R6),\"\",R6)","v":""}]
[null,"Address:",null,null,null,null,null,null,"Dealer No.",null,null,null,null,null,null,null,null,{"$f":"IF(VLOOKUP(P19,Options!A1:E25,4,0)<15,\"PIN ON\",\"\")","v":{"$error":"#N/A"}},null,null,null,null,null,{"$f":"IF(ISERROR(R7),\"\",R7)","v":""}]
[]
[null,null,null,null,null,"State:",null,null,null,null,"Valid thru April 30, 2017"]
[null,null,null,null,null,null,null,null,null,null,null,null,null,null,null,null,null,null,"AGCO"]
{"$rows_left_out":113}
{"sheet":"Options","index":5,"n_rows":42,"n_cols":22,"rows_kept":42,"cut":false,"hidden":true,"merged":[[35,9,35,11],[35,13,35,15],[36,9,36,11],[36,13,36,15],[31,11,31,13],[32,11,32,13]]}
["Q21",4491,"Q",21,1,null,5220651,5220650,5220451,9031984,{"$f":"VLOOKUP(A$42,'trip costs'!A:K,6,0)","v":{"$error":"#N/A"}},null,null,{"$f":"\"\"","v":""},null,null,null,null,null,"N/A"]
["Q26",6796,"Q",26,1,null,5220651,5220650,5220451,9031984,{"$f":"VLOOKUP(A$42,'trip costs'!A:K,7,0)","v":{"$error":"#N/A"}},null,null,{"$f":"\"\"","v":""},null,null,null,null,null,"N/A"]
["Q31",4892,"Q",31,1,null,5220651,5220650,5220451,9031984,{"$f":"VLOOKUP(A$42,'trip costs'!A:K,7,0)","v":{"$error":"#N/A"}},null,null,{"$f":"\"\"","v":""},null,null,null,null,null,"N/A"]
["Q36",7617,"Q",36,1,null,5220651,5220650,5220451,9031984,{"$f":"VLOOKUP(A$42,'trip costs'!A:K,7,0)","v":{"$error":"#N/A"}},null,null,{"$f":"\"\"","v":""},null,null,null,null,null,"N/A"]
["Q41",6087,"Q",41,1,null,5220651,5220650,5220451,9031984,{"$f":"VLOOKUP(A$42,'trip costs'!A:K,7,0)","v":{"$error":"#N/A"}},null,null,{"$f":"\"\"","v":""},null,null,null,null,null,"N/A"]
["Q46",8126,"Q",46,1,null,5220651,5220650,5220451,9031984,{"$f":"VLOOKUP(A$42,'trip costs'!A:K,8,0)","v":{"$error":"#N/A"}},null,null,{"$f":"\"\"","v":""},null,null,null,null,null,"N/A"]
["Q51",6408,"Q",51,1,null,5220653,5220652,5220451,9031986,{"$f":"VLOOKUP(A$42,'trip costs'!A:K,8,0)","v":{"$error":"#N/A"}},null,null,"You should consider SoftDrive for this configuration!",null,null,null,null,null,"N/A"]
["Q56",9149,"Q",56,1,null,5220653,5220652,5220451,9031986,{"$f":"VLOOKUP(A$42,'trip costs'!A:K,8,0)","v":{"$error":"#N/A"}},null,null,"You should consider SoftDrive for this configuration!",null,null,null,null,null,"N/A"]
["Q61",7964,"Q",61,1,null,5220653,5220653,5220451,9031988,{"$f":"VLOOKUP(A$42,'trip costs'!A:K,8,0)","v":{"$error":"#N/A"}},null,null,"You should consider SoftDrive for this configuration!",null,null,null,null,null,"N/A"]
["Q66",9515,"Q",66,1,null,5220653,5220653,5220451,9031988,{"$f":"VLOOKUP(A$42,'trip costs'!A:K,9,0)","v":{"$error":"#N/A"}},null,null,"You should consider SoftDrive for this configuration!",null,null,null,null,null,{"$f":"K10*2","v":{"$error":"#N/A"}}]
{"$rows_left_out":33}
{"sheet":"trip costs","index":6,"n_rows":61,"n_cols":23,"rows_kept":61,"cut":false,"hidden":true,"merged":[]}
["FREIGHT","CLASS",null,null,6,7,7,7,7,null,7]
["RATES"]
[]
["STATE",null,null,"100-180C","X21","Q21,X26,X31,X36","Q26-Q41    X41-X51","Q46-Q61, X56","Q66","Q76","Q88",null,"STATE",null,"1847, 1045, 2247","2045, 3045, 180C","2347, 160C SL, 180C SL, 3545, 2427, 2447, 4045, 200N","5045, 200P, 2847, 220N, 6045, S21, 220P","Q31/33, 240N, 3227, 240P, Q26, 260N, Q41, Q36/38","Q46/48, 260P, Q51, Q61, Q56/58","Q66/68","Q76/78","Q88"]
["AL","ALABAMA",null,226,231,278,324,369,{"$f":"H5+150","v":519},{"$f":"H5+200","v":569},{"$f":"H5+250","v":619},null,"AL","ALABAMA",141,226,231,278,324,369,519,569,619]
["AR","ARKANSAS",null,328,349,419,489,559,{"$f":"H6+150","v":709},{"$f":"H6+200","v":759},{"$f":"H6+250","v":809},null,"AR","ARKANSAS",205,328,349,419,489,559,709,759,809]
["AZ","ARIZONA",null,434,457,548,639,730,880,930,980,null,"AZ","ARIZONA",272,434,457,548,639,730,880,930,980]
["CA","CALIFORNIA",null,566,595,714,764,873,1023,1073,1123,null,"CA","CALIFORNIA",354,566,595,714,764,873,1023,1073,1123]
["CO","COLORADO",null,438,460,552,644,675,825,875,925,null,"CO","COLORADO",274,438,460,552,644,675,825,875,925]
["CT","CONNECTICUT",null,318,325,390,455,519,669,719,769,null,"CT","CONNECTICUT",199,318,325,390,455,519,669,719,769]
{"$rows_left_out":52}
{"sheet":"Loader Details","index":7,"n_rows":477,"n_cols":32,"rows_kept":477,"cut":false,"hidden":true,"merged":[]}
["Tractor Model","2/4","Version","Width","Note #1","Note #2","Note #3","Note #4","Loaders","Loaders","Loaders","Loaders","Loaders","Loaders","Loaders","Loaders","Subframe","Grill Guard",null,"2 Mechanical","2 Electric","2 Hose","3 Hose","X Width #","Q Width #","Conversion Kit","Cab","Rops"]
["GT45, 55 and \"A\"","2/4","ROPS/CAB","DS",4,5,null,null,{"$f":"\"\"","v":""},{"$f":"\"\"","v":""},{"$f":"\"\"","v":""},{"$f":"\"\"","v":""},"Q21",{"$f":"\"\"","v":""},"Q26",{"$f":"\"\"","v":""},14310515,null,null,"15155BAA",{"$f":"\"\"","v":""},{"$f":"\"\"","v":""},{"$f":"\"\"","v":""},{"$f":"IF(D2=\"US\",\"U\",\"L\")","v":"L"},{"$f":"IF(D2=\"DS\",\"3\",IF(D2=\"DM\",\"4\",IF(D2=\"US\",\"1\",IF(D2=\"UM\",\"2\",IF(D2=\"DL\",\"3\")))))","v":"3"},null,{"$f":"\"\"","v":""},{"$f":"\"\"","v":""}]
["GT55 and \"A\"","2/4","CAB","DS",4,6,null,null,{"$f":"\"\"","v":""},{"$f":"\"\"","v":""},{"$f":"\"\"","v":""},{"$f":"\"\"","v":""},"Q21",{"$f":"\"\"","v":""},"Q26",{"$f":"\"\"","v":""},14310505,null,null,"15155BAA",{"$f":"\"\"","v":""},{"$f":"\"\"","v":""},{"$f":"\"\"","v":""},{"$f":"IF(D3=\"US\",\"U\",\"L\")","v":"L"},{"$f":"IF(D3=\"DS\",\"3\",IF(D3=\"DM\",\"4\",IF(D3=\"US\",\"1\",IF(D3=\"UM\",\"2\",IF(D3=\"DL\",\"3\")))))","v":"3"},null,{"$f":"\"\"","v":""},{"$f":"\"\"","v":""}]
["GT65, 75 and \"A\"","2/4","ROPS/CAB","DS",4,5,null,null,{"$f":"\"\"","v":""},{"$f":"\"\"","v":""},{"$f":"\"\"","v":""},{"$f":"\"\"","v":""},"Q21","Q31","Q26","Q36",14310495,null,null,"15155BAA",{"$f":"\"\"","v":""},{"$f":"\"\"","v":""},{"$f":"\"\"","v":""},"L","3",null,{"$f":"\"\"","v":""},{"$f":"\"\"","v":""}]
["GT75 and \"A\"","2/4","CAB","DS",4,6,null,null,{"$f":"\"\"","v":""},{"$f":"\"\"","v":""},{"$f":"\"\"","v":""},{"$f":"\"\"","v":""},"Q31",{"$f":"\"\"","v":""},"Q36",{"$f":"\"\"","v":""},14310615,null,null,"15155BAA",{"$f":"\"\"","v":""},{"$f":"\"\"","v":""},{"$f":"\"\"","v":""},"L","3",null,{"$f":"\"\"","v":""},{"$f":"\"\"","v":""}]
["LT75, 90","2/4","ROPS/CAB",{"$f":"IF(E6=11,\"US\",\"DM\")","v":"DM"},1,null,null,null,"X41",{"$f":"\"\"","v":""},"X46",{"$f":"\"\"","v":""},"Q41",{"$f":"\"\"","v":""},"Q46",{"$f":"\"\"","v":""},14321115,null,null,"15013BFA",{"$f":"\"\"","v":""},{"$f":"\"\"","v":""},{"$f":"\"\"","v":""},"L","4",null,{"$f":"\"\"","v":""},{"$f":"\"\"","v":""}]
["LT \"A\" 75, 85, 90, 95 AUTO IV TIER II and III","2/4","ROPS/CAB","DM",1,null,null,null,"X41","X51","X46","X56","Q41","Q51","Q46","Q56",14322815,null,null,"15013BFA",{"$f":"\"\"","v":""},{"$f":"\"\"","v":""},{"$f":"\"\"","v":""},"L","4",null,{"$f":"\"\"","v":""},{"$f":"\"\"","v":""}]
["LT \"A\" 75, 90 Speed Shift","2/4","ROPS/CAB","DM",1,null,null,null,"X41","X51","X46","X56","Q41","Q51","Q46","Q56",14322325,null,null,"15013BFA",{"$f":"\"\"","v":""},{"$f":"\"\"","v":""},{"$f":"\"\"","v":""},"L","4",null,{"$f":"\"\"","v":""},{"$f":"\"\"","v":""}]
["RT 100, 120 Auto Quad",4,"CAB","DM",3,null,null,null,{"$f":"\"\"","v":""},{"$f":"\"\"","v":""},{"$f":"\"\"","v":""},{"$f":"\"\"","v":""},"Q61",{"$f":"\"\"","v":""},"Q66",{"$f":"\"\"","v":""},14320505,null,null,"15020BAA",{"$f":"\"\"","v":""},{"$f":"\"\"","v":""},{"$f":"\"\"","v":""},"L","4",null,{"$f":"\"\"","v":""},{"$f":"\"\"","v":""}]
["RT 100, 120 Dyna VT",4,"CAB","DM",2,3,null,null,{"$f":"\"\"","v":""},{"$f":"\"\"","v":""},{"$f":"\"\"","v":""},{"$f":"\"\"","v":""},"Q61",{"$f":"\"\"","v":""},"Q66",{"$f":"\"\"","v":""},14320515,null,null,"15020BAA",{"$f":"\"\"","v":""},{"$f":"\"\"","v":""},{"$f":"\"\"","v":""},"L","4",null,{"$f":"\"\"","v":""},{"$f":"\"\"","v":""}]
{"$rows_left_out":468}
{"sheet":"OEM","index":8,"n_rows":48,"n_cols":2,"rows_kept":48,"cut":false,"hidden":true,"merged":[]}
["Farmall 75C (Turkish Built) T4","MUST BE SOURCED THROUGH CNH"]
["Farmall 85C, 95C,105C,115C EP T4","MUST BE SOURCED THROUGH CNH"]
["Farmall 45A,50A,60A,70A T4","MUST BE SOURCED THROUGH CNH"]
["Farmall 65C-120C T4","MUST BE SOURCED THROUGH CNH"]
["Farmall 85U, 95U, 105U, 115U EP T4","MUST BE SOURCED THROUGH CNH"]
["Farmall 110A, 120A, 125A, 140A T4","MUST BE SOURCED THROUGH CNH"]
["Maxxum 115, 125,135,145,150 T4","MUST BE SOURCED THROUGH CNH"]
["Puma 150,165,185,200,220,240 T4","MUST BE SOURCED THROUGH CNH"]
["Optum 270,300","MUST BE SOURCED THROUGH CNH"]
["Magnum 180-240 T4","MUST BE SOURCED THROUGH CNH"]
{"$rows_left_out":39}
{"sheet":"AGCO","index":9,"n_rows":201,"n_cols":1,"rows_kept":201,"cut":false,"hidden":true,"merged":[]}
["GT45, 55 and \"A\""]
["GT55 and \"A\""]
["GT65, 75 and \"A\""]
["GT75 and \"A\""]
["LT75, 90"]
["LT \"A\" 75, 85, 90, 95 AUTO IV TIER II and III"]
["LT \"A\" 75, 90 Speed Shift"]
["RT 100, 120 Auto Quad"]
["RT 100, 120 Dyna VT"]
["RT 135, 150 Auto Quad"]
{"$rows_left_out":192}
{"sheet":"AGCO Allis","index":10,"n_rows":172,"n_cols":1,"rows_kept":172,"cut":false,"hidden":true,"merged":[]}
["8745, 8765 (Valtra Engine)"]
["8745, 8765 (Cummins Engine)"]
["8745, 8765 (Cummins Engine)"]
["8775, 8785 (Valtra Engine)"]
["8775, 8785 (Cummins Engine)"]
["4650, 4660 "]
["5650, 5660"]
["5670, 5680"]
["8610, 8630"]
[{"$f":"\"\"","v":""}]
{"$rows_left_out":163}
{"sheet":"AGCO White","index":11,"n_rows":171,"n_cols":1,"rows_kept":171,"cut":false,"hidden":true,"merged":[]}
["6410, 6510"]
["6410, 6510"]
["6710, 6810'"]
["8310, 8410"]
["6045 ROPS"]
["6065 ROPS"]
["6065 CAB"]
["6105 CAB"]
[{"$f":"\"\"","v":""}]
[{"$f":"\"\"","v":""}]
{"$rows_left_out":162}
{"sheet":"Buhler","index":12,"n_rows":164,"n_cols":1,"rows_kept":164,"cut":false,"hidden":true,"merged":[]}
["Genesis 2145, 2160, 2180, 2210"]
[{"$f":"\"\"","v":""}]
[{"$f":"\"\"","v":""}]
[{"$f":"\"\"","v":""}]
[{"$f":"\"\"","v":""}]
[{"$f":"\"\"","v":""}]
[{"$f":"\"\"","v":""}]
[{"$f":"\"\"","v":""}]
[{"$f":"\"\"","v":""}]
[{"$f":"\"\"","v":""}]
{"$rows_left_out":155}
{"sheet":"Case","index":13,"n_rows":218,"n_cols":1,"rows_kept":218,"cut":false,"hidden":true,"merged":[]}
["Farmall 75C (Turkish Built) T4"]
["Farmall 85C, 95C,105C,115C EP T4"]
["Farmall 45A,50A,60A,70A T4"]
["Farmall 65C-120C T4"]
["Farmall 85U, 95U, 105U, 115U EP T4"]
["Farmall 110A, 120A, 125A, 140A T4"]
["Maxxum 115, 125,135,145,150 T4"]
["Puma 150,165,185,200,220,240 T4"]
["Optum 270,300"]
["Magnum 180-240 T4"]
{"$rows_left_out":209}
{"sheet":"Challenger","index":14,"n_rows":194,"n_cols":1,"rows_kept":194,"cut":false,"hidden":true,"merged":[]}
["MT555D - MT575D Auto VI (Classic Cab)"]
["MT555D - MT575D Auto VI (Deluxe)"]
["MT555D, MT565D, MT575D CVT (Deluxe)"]
["MT585D, MT595D Auto VI (Classic Cab)"]
["MT585D, MT595D Auto VI (Deluxe)"]
["MT585D CVT (Deluxe)"]
["MT645C, 655C, 665C, 675C CVT "]
["MT645D, 655D, 665D, 675D"]
["MT 315B, 325B, 335B and 345B"]
["MT 425B Dyna-4 "]
{"$rows_left_out":185}
{"sheet":"Deutz","index":15,"n_rows":191,"n_cols":1,"rows_kept":191,"cut":false,"hidden":true,"merged":[]}
["Agrolux 45-75"]
["Agroplus 310,315,320 + Ecoline"]
["Agrolplus 410,420 + Ecoline"]
["Agrofarm 85, 100, 410, 420 and 430"]
["Agrofarm TTV420 and TTV430 + Profiline"]
["Agrofarm 410T and 420T"]
["Agrofarm 410TB and 420TB"]
["Agrotron K90-120, K410,420 and 430"]
["Agrotron K90-120, K410,420, 430 (Profiline)"]
["Agrotron K-110 and K-610"]
{"$rows_left_out":182}
{"sheet":"John Deere","index":16,"n_rows":220,"n_cols":1,"rows_kept":220,"cut":false,"hidden":true,"merged":[]}
["5045E, 5055E, 5065E, 5075E (Teir 3)"]
["5045E, 5055E, 5065E, 5075E (Teir 4)"]
["5085E, 5100E (Teir 3)"]
["5085E, 5100E  (Teir4)"]
["5083E, 5093E, 5101E, 5425, 5525, 5625, 5603"]
["5065M, 5075M, 5085M (Teir 3&4)"]
["5095M, 5105M, 5100M, 5115M (Teir 3&4)"]
["6100D, 6115D, 6130D, 6140D"]
["61105D, 6115D, 6130D, 60140D T4"]
["6105E, 6120E, 6135E T4F"]
{"$rows_left_out":211}
{"sheet":"Kubota","index":17,"n_rows":183,"n_cols":1,"rows_kept":183,"cut":false,"hidden":true,"merged":[]}
["M5040-M7040, M5060-7060"]
["M5-091, 101"]
["M6-101, 111"]
["M6-131, 141"]
["M6S-111"]
["M7-131, 151, 171"]
["M8540, 9540"]
["M8560, M9960 TIER 4I"]
["M95S, M105S"]
["M96S, M108S"]
{"$rows_left_out":174}
{"sheet":"Landini","index":18,"n_rows":191,"n_cols":1,"rows_kept":191,"cut":false,"hidden":true,"merged":[]}
["Alpine 70,80,85 Tier 3 STD /  GT"]
["Powerfarm 60 TIER 2"]
["Powerfarm 75-105 TIER 2 & 90-110 TIER 3"]
["5-090H, 5-100H, 5-110H"]
["Vision 80, 85, 90 TIER 2"]
["Vision 95 - 105 TIER 2 & 3"]
["Powermondial 100, 105, 115"]
["Landpower 125, 135 TIER 2"]
["Landpower 145 TIER 2"]
["Landpower 165, 185 TIER 2"]
{"$rows_left_out":182}
{"sheet":"MF","index":19,"n_rows":227,"n_cols":1,"rows_kept":227,"cut":false,"hidden":true,"merged":[]}
["2605, 2615, 2625, 2635"]
["4608, 4609, 4610"]
["5609, 5610, 5611, 5612, 5613"]
["6614, 6615, 6616"]
["7619, 7620, 7622 DYNA IV Classic Cab"]
["7619, 7620, 7622 DYNA IV Deluxe & Premium"]
["7619, 7620, 7622 CVT Deluxe & Premium"]
["7624, 7626 DYNA IV Classic Cab"]
["7624, 7626 DYNA IV Deluxe & Premium"]
["7624 CVT Deluxe & Premium Cab"]
{"$rows_left_out":218}
{"sheet":"McCormick","index":20,"n_rows":188,"n_cols":1,"rows_kept":188,"cut":false,"hidden":true,"merged":[]}
["C-Max 60"]
["C-Max 75 - 105 TIER 2 and 3"]
["T90Max, T100Max, T110Max"]
["C70 - C100"]
["C70 - C100"]
["C60/70/80L"]
["CX70, 75, 80, 85, 90, 95, 100, 105 (Doncaster)"]
["CX90, 100, 110 TIER 3 (Italy)"]
["X50.20, X50.30, X50.40, X50.50"]
["X60.20, X60.30, X60.40, X60.50 "]
{"$rows_left_out":179}
{"sheet":"NH","index":21,"n_rows":87,"n_cols":1,"rows_kept":87,"cut":false,"hidden":true,"merged":[]}
["Workmaster 45, 50, 55, 60, 70"]
["Powerstar T4.65, T4.75 T4B"]
["T4.85 - 120 T4"]
["T5.95 - 120 T4"]
["T6.120, .140, .150, .160"]
["T6.155, .165, .175"]
["T7.170, .185, .200, .210, .235 EP"]
["T7.220, .235, .250, .260, .270 EP"]
["T8.275, .300, .330, .360, .390, .420"]
["TT60A, TT65A,TT75A"]
{"$rows_left_out":78}
{"sheet":"Valtra","index":22,"n_rows":180,"n_cols":1,"rows_kept":180,"cut":false,"hidden":true,"merged":[]}
["800, 900"]
["A72, A75, A82, A85, A92, A95"]
["C90, 100, 110, 120, 130, 150"]
["N82, N92"]
["N91, 101,111, 111e, 121, 141"]
["N121ADV, N141ADV"]
["N122, N142 Direct / Versu"]
["T121, 131, 151, 161, 171, 191 Classic"]
["T151, 161, 171, 191 ADV"]
["T120, 130, 140, 160, 170 Classic"]
{"$rows_left_out":171}
{"sheet":"KIOTI","index":23,"n_rows":480,"n_cols":1,"rows_kept":480,"cut":false,"hidden":true,"merged":[]}
["CK20S, CK20SHST "]
["DK40SE, DK45SE , DK50SE + HST "]
["DK55, DK55C "]
[{"$f":"\"\"","v":""}]
[{"$f":"\"\"","v":""}]
[{"$f":"\"\"","v":""}]
[{"$f":"\"\"","v":""}]
[{"$f":"\"\"","v":""}]
[{"$f":"\"\"","v":""}]
[{"$f":"\"\"","v":""}]
{"$rows_left_out":471}
{"sheet":"MAHINDRA","index":24,"n_rows":126,"n_cols":1,"rows_kept":126,"cut":false,"hidden":true,"merged":[]}
["5010'"]
["5035'"]
[{"$f":"\"\"","v":""}]
[{"$f":"\"\"","v":""}]
[{"$f":"\"\"","v":""}]
[{"$f":"\"\"","v":""}]
[{"$f":"\"\"","v":""}]
[{"$f":"\"\"","v":""}]
[{"$f":"\"\"","v":""}]
[{"$f":"\"\"","v":""}]
{"$rows_left_out":116}